{"text_format":"1","workbook":"xlsx","n_sheets":14,"sheets":["Text","MPI","Ertrag","Anlagekosten","Beschickung","Substrat","Datentabelle","TierischeSubstrate","Cosubstrate","Mastschweine","Wiese_Silage","Grünroggen","Getreide - GPS ","Silomais "],"not_rendered":{"charts":2,"images":6,"macros":1,"external_links":3,"defined_names":97,"comments":0,"pivot_tables":0},"unopened":[],"bounds":{"document_bytes":16777216,"sheet_cells":100000,"rows_first":2000,"rows_last":500,"rows_between":2000,"halvings":0,"cell_chars":16384,"cell_head_chars":4096},"cells_cut":0,"cells_raw":0,"read":"whole","date_system":"1900"}

{"sheet":"Text","index":0,"n_rows":159,"n_cols":17,"rows_kept":159,"cut":false,"hidden":false,"merged":[[113,5,120,5],[142,5,149,5]]}
[null,null,"Beurteilung der Wirtschaftlichkeit einer"]
[null,null,"Investition in eine Biogasanlage"]
[null,null,"(Trockenfermentation im BATCH-Verfahren)"]
[]
[null,null,"Bei betrieblichen Überlegungen zu Investitionen im Bereich der Biogastechnolgie kommt der"]
[null,null,"ökonomischen Beurteilung der Anlage eine entscheidende Rolle zu."]
[null,null,"Aufgrund einer Vielzahl von Zusammenhängen mit anderen Betriebszweigen der landwirtschaftlichen"]
[null,null,"Produktion ist es notwendig, die Planung ganzheitlich durchzuführen (um z.B. auch arbeitswirt-"]
[null,null,"schaftliche Aspekte berücksichtigen zu können)."]
[]
{"$rows_left_out":150}
{"sheet":"MPI","index":1,"n_rows":43,"n_cols":25,"rows_kept":43,"cut":false,"hidden":false,"merged":[]}
[null,"Mehrperiodische Investionsrechnung für eine Biogasanlage (Nassfermentation)"]
[]
[null,"Perioden",null,null,0,1,2,3,4,5,6,7,8,9,10,11,12,13,14,15,16,17,18,19,20]
[]
[null,"Einzahlungen"]
[null,"Energieertrag",null,null,null,{"$f":"Ertrag!$E$34","v":660714.44848555373},{"$f":"Ertrag!$E$34","v":660714.44848555373},{"$f":"Ertrag!$E$34","v":660714.44848555373},{"$f":"Ertrag!$E$34","v":660714.44848555373},{"$f":"Ertrag!$E$34","v":660714.44848555373},{"$f":"Ertrag!$E$34","v":660714.44848555373},{"$f":"Ertrag!$E$34","v":660714.44848555373},{"$f":"Ertrag!$E$34","v":660714.44848555373},{"$f":"Ertrag!$E$34","v":660714.44848555373},{"$f":"Ertrag!$E$34","v":660714.44848555373},{"$f":"Ertrag!$E$34","v":660714.44848555373},{"$f":"Ertrag!$E$34","v":660714.44848555373},{"$f":"Ertrag!$E$34","v":660714.44848555373},{"$f":"Ertrag!$E$34","v":660714.44848555373},{"$f":"Ertrag!$E$34","v":660714.44848555373},{"$f":"Ertrag!$E$34","v":660714.44848555373},{"$f":"Ertrag!$E$34","v":660714.44848555373},{"$f":"Ertrag!$E$34","v":660714.44848555373},{"$f":"Ertrag!$E$34","v":660714.44848555373},{"$f":"Ertrag!$E$34","v":660714.44848555373}]
[null,"Dungwert",null,null,null,{"$f":"Ertrag!$J$69","v":54363.668399999995},{"$f":"Ertrag!$J$69","v":54363.668399999995},{"$f":"Ertrag!$J$69","v":54363.668399999995},{"$f":"Ertrag!$J$69","v":54363.668399999995},{"$f":"Ertrag!$J$69","v":54363.668399999995},{"$f":"Ertrag!$J$69","v":54363.668399999995},{"$f":"Ertrag!$J$69","v":54363.668399999995},{"$f":"Ertrag!$J$69","v":54363.668399999995},{"$f":"Ertrag!$J$69","v":54363.668399999995},{"$f":"Ertrag!$J$69","v":54363.668399999995},{"$f":"Ertrag!$J$69","v":54363.668399999995},{"$f":"Ertrag!$J$69","v":54363.668399999995},{"$f":"Ertrag!$J$69","v":54363.668399999995},{"$f":"Ertrag!$J$69","v":54363.668399999995},{"$f":"Ertrag!$J$69","v":54363.668399999995},{"$f":"Ertrag!$J$69","v":54363.668399999995},{"$f":"Ertrag!$J$69","v":54363.668399999995},{"$f":"Ertrag!$J$69","v":54363.668399999995},{"$f":"Ertrag!$J$69","v":54363.668399999995},{"$f":"Ertrag!$J$69","v":54363.668399999995}]
[null,"Zuschuss",null,null,null,{"$f":"Anlagekosten!G31","v":0}]
[null,"Umlaufvermögensfreisetzung",null,null,null,null,null,null,null,null,null,null,null,null,null,null,null,null,null,null,null,null,null,null,{"$f":"$E$15","v":215031.84392000001}]
[null,"Restwerte Anlagen"]
{"$rows_left_out":34}
{"sheet":"Ertrag","index":2,"n_rows":69,"n_cols":12,"rows_kept":69,"cut":false,"hidden":false,"merged":[]}
[]
[null,"Ertragsberechnung"]
[]
[null,"Energieertrag"]
[null,1,"Energiegehalt des Methangases (100 %)",null,9.94,"kWh/m³"]
[null,2,"× Methangehalt bei Produktion",null,{"$f":"Methangehalt","v":0.6}]
[null,3,"= Energiegeh. d. Methangases (Prod.)",null,{"$f":"E5*E6","v":5.9639999999999995},"kWh/m³"]
[null,"–"]
[null,4,"Gesamtsubstratmenge",null,{"$f":"Substrat!O42","v":30205.9503},"dt/oTS "]
[null,5,"× Gasaubeute je dt",null,{"$f":"Substrat!Q42/Substrat!O42","v":69.415717554828916},"m³/dt oTS "]
{"$rows_left_out":60}
{"sheet":"Anlagekosten","index":3,"n_rows":32,"n_cols":16,"rows_kept":32,"cut":false,"hidden":false,"merged":[[13,14,13,15]]}
[]
[null,null,"Anschaffungs-/ Herstellungskosten, Betriebskosten der Anlage"]
[]
[null,null," Beschreibung",null,"Anschaffung (einmalig)",null,null,"Großrep.","Lfd. Kost"]
[null,null,null,null,"Anzahl","Preis","Kosten","alle 3 J.","jährlich",null,"Berechnung des Investitionsvolumen nach Durchschnittssätzen "]
[null,null,null,null,null,"€","€","€","€"]
[null,null,"Fermenter",null,1,40000,{"$f":"F7*E7","v":40000},null,null,null,"durchschnittl. Kosten pro kWelek."]
[null,null,"Gärrückstandslager",null,1,81720,81720]
[null,null,"Elektroinstallationen",null,1,4000,4000,null,null,null,"bis",200,"kW",3500,"€/kW elek."]
[null,null,"Heizungsinstallationen",null,1,10000,10000,null,null,null,"bis ",500,"kW",2700,"€/kW elek."]
{"$rows_left_out":23}
{"sheet":"Beschickung","index":4,"n_rows":31,"n_cols":28,"rows_kept":31,"cut":false,"hidden":false,"merged":[]}
[]
[null,null,null,"Befüllung, Entleerung und Kontrolle des Containers: variable Kosten und Arbeitszeitbedarf"]
[]
[null,null,null,"Einh.","Verfahren","für 1 × Befüll./Entleer. je Cont.",null,null,"Gesamt *",null,null,"* Erläuterung zu Gesamt:",null,null,null,null,null,null,null,null,null,null,null,null,null,null,"Fixkost.*","ZA **)"]
[null,null,null,null,null,"Umfang","AKh","€","Umfang","AKh","€","feste Substrate  ",null,null,{"$f":"Substrat!K25","v":17459.828571428574},"m³"]
[null,null,null,"m³","Siloentnahme (Frontlader)",1,{"$f":"0.04*F6","v":0.04},{"$f":"1.27456*F6","v":1.2745599999999999},{"$f":"F6*$O$5","v":17459.828571428574},{"$f":"0.04*I6","v":698.39314285714295},{"$f":"1.27456*I6","v":22253.599104000001},"   flüssige Substrate ",null,null,{"$f":"Substrat!K34","v":1350},"m³",null,null,null,70,null,null,null,null,null,null,{"$f":"IF($A6=0,0,VLOOKUP($A6,ltPflArbGang,MKFKoZA,FALSE)*F6)","v":0},{"$f":"IF($A6=0,0,VLOOKUP($A6,ltPflArbGang,MKZA,FALSE)*F6)","v":0}]
[null,null,null,"m³","Befüllung feste Substrate",1,{"$f":"0.02*F7","v":0.02},{"$f":"0.65828*F7","v":0.65827999999999998},{"$f":"F7*$O$5","v":17459.828571428574},{"$f":"0.02*I7","v":349.19657142857147},{"$f":"0.65828*I7","v":11493.455952000002},"   Gärrest",null,null,{"$f":"Substrat!M42/10","v":10114.58805},"m³",null,null,null,3.5,null,null,null,null,null,null,{"$f":"IF($A7=0,0,VLOOKUP($A7,ltPflArbGang,MKFKoZA,FALSE)*#REF!)","v":0},{"$f":"IF($A7=0,0,VLOOKUP($A7,ltPflArbGang,MKZA,FALSE)*#REF!)","v":0}]
[null,null,null,"m³","Befüllung flüssige Substrate ",1,8.0000000000000002E-3,{"$f":"0.65828*F8","v":0.65827999999999998},{"$f":"O6","v":1350},{"$f":"0.02*I8","v":27},{"$f":"0.65828*I8","v":888.678},null,null,null,null,null,null,null,null,100,null,null,null,null,null,null,{"$f":"IF($A8=0,0,VLOOKUP($A8,ltPflArbGang,MKFKoZA,FALSE)*F7)","v":0},{"$f":"IF($A8=0,0,VLOOKUP($A8,ltPflArbGang,MKZA,FALSE)*F7)","v":0}]
[null,null,null,null,null,null,null,null,null,{"$f":"0.02*I9","v":0},{"$f":"0.65828*I9","v":0},"    Dichte Gärrest ",null,null,1,"kg/l",null,null,null,90,null,null,null,null,null,null,0,0]
[null,null,null,"m³","Substratausbringung ",1,0.06,1.5,{"$f":"O7","v":10114.58805},{"$f":"0.02*I10","v":202.29176100000001},{"$f":"0.65828*I10","v":6658.2310215540001},null,null,null,null,null,null,null,null,4.5,null,null,null,null,null,null,0,0]
{"$rows_left_out":22}
{"sheet":"Substrat","index":5,"n_rows":42,"n_cols":21,"rows_kept":42,"cut":false,"hidden":false,"merged":[[10,13,10,14],[10,15,10,16],[10,9,10,10],[10,11,10,12]]}
[null,null,"Code der Bilanz",100,101,130,130,930,930,931,931,null,null,null,null,null,null,140,500,701,702]
[null,null,"Spaltenindex aus ZusPV",{"$f":"IF(ISNA(HLOOKUP(D$1,ltZusBilanz,2,FALSE))=TRUE,0,HLOOKUP(D$1,ltZusBilanz,2,FALSE))","v":{"$error":"#VALUE!"}},{"$error":"#VALUE!"},{"$error":"#VALUE!"},{"$error":"#VALUE!"},{"$error":"#VALUE!"},{"$error":"#VALUE!"},{"$error":"#VALUE!"},{"$error":"#VALUE!"},null,null,null,null,null,null,{"$error":"#VALUE!"},{"$error":"#VALUE!"},{"$error":"#VALUE!"},{"$error":"#VALUE!"}]
[null,null,"Bezeichnung",{"$f":"IF(ISNA(VLOOKUP(D$1,ltBilanz,2,FALSE))=TRUE,\"\",VLOOKUP(D$1,ltBilanz,2,FALSE))","v":{"$error":"#VALUE!"}},{"$error":"#VALUE!"},{"$error":"#VALUE!"},{"$error":"#VALUE!"},{"$error":"#VALUE!"},{"$error":"#VALUE!"},{"$error":"#VALUE!"},{"$error":"#VALUE!"},null,null,null,null,null,null,{"$error":"#VALUE!"},{"$error":"#VALUE!"},{"$error":"#VALUE!"},{"$error":"#VALUE!"}]
[null,null,"Einheit",{"$f":"IF(ISNA(VLOOKUP(D$1,ltBilanz,3,FALSE))=TRUE,\"\",VLOOKUP(D$1,ltBilanz,3,FALSE))","v":{"$error":"#VALUE!"}},{"$error":"#VALUE!"},{"$error":"#VALUE!"},{"$error":"#VALUE!"},{"$error":"#VALUE!"},{"$error":"#VALUE!"},{"$error":"#VALUE!"},{"$error":"#VALUE!"},null,null,null,null,null,null,{"$error":"#VALUE!"},{"$error":"#VALUE!"},{"$error":"#VALUE!"},{"$error":"#VALUE!"}]
[]
[]
[]
[null,null,"Substraterzeugung"]
[]
[null,null,"Produktionsverfahren",null,null,"Var. Kosten",null,"Substraterzeugung",null,null,null,null,null,null,null,null,null,"Bedarf an"]
{"$rows_left_out":33}
{"sheet":"Datentabelle","index":6,"n_rows":16,"n_cols":13,"rows_kept":16,"cut":false,"hidden":false,"merged":[[10,2,15,4],[3,0,8,0],[9,0,15,0],[1,0,2,1]]}
[]
[null,null,"var.Kosten ","UVV","Arbeitszeitbedarf","Menge TS ","oTS - Gehalt ","Erntemenge oTS ","Gasausbeute  ","Gasausbeute m³","Substratmenge ","Substratvolumen ","Substratmenge Gärrest"]
[null,null,"€/ha","€/ha","h/ha","dt","%","dt/ha","m³/dt oTS ","m³","dt","m³","dt"]
["Fläche ","Ackerland "]
[null,"Silomais ",{"$f":"'Silomais '!M43","v":851.54650000000004},{"$f":"'Silomais '!M46","v":425.77325000000002},{"$f":"'Silomais '!L64","v":9.08},{"$f":"'Silomais '!M8","v":121.5},{"$f":"Cosubstrate!$C$45","v":0.96},{"$f":"F5*G5","v":116.64},{"$f":"Cosubstrate!$D$45*100","v":70},{"$f":"H5*I5","v":8164.8},{"$f":"'Silomais '!K7","v":450},{"$f":"'Silomais '!M48","v":67.5},{"$f":"K5-(F5*Cosubstrate!K45)","v":389.25}]
[null,"Grünroggen",{"$f":"Grünroggen!M43","v":672.91464285714289},{"$f":"Grünroggen!M46","v":336.45732142857145},{"$f":"Grünroggen!L64","v":8.98},{"$f":"Grünroggen!M8","v":49.5},0.9,{"$f":"F6*G6","v":44.550000000000004},60,{"$f":"H6*I6","v":2673.0000000000005},{"$f":"Grünroggen!K7","v":250},{"$f":"Grünroggen!M48","v":32.142857142857146},{"$f":"K6-(F6*Cosubstrate!K28)","v":225.25}]
[null,"Getreide - GPS ",{"$f":"+'Getreide - GPS '!M43","v":810.23300000000006},{"$f":"'Getreide - GPS '!M46","v":405.11650000000003},{"$f":"'Getreide - GPS '!L64","v":9.08},{"$f":"'Getreide - GPS '!M8","v":110.24999999999999},0.89,98.122499999999988,55,5396.7374999999993,{"$f":"'Getreide - GPS '!K7","v":350},{"$f":"+'Getreide - GPS '!M48","v":52.5},{"$f":"K7-(F7*Cosubstrate!K23)","v":294.875}]
[null,"Grünland "]
[null,"Grassilage ",{"$f":"Wiese_Silage!M43","v":402.2},{"$f":"Wiese_Silage!M46","v":201.1},{"$f":"Wiese_Silage!L65","v":10},{"$f":"Wiese_Silage!M8","v":45.9},{"$f":"Cosubstrate!$C$26","v":0.9},41.31,{"$f":"Cosubstrate!$D$26*100","v":55.000000000000007},2272.0500000000006,{"$f":"Wiese_Silage!K7","v":300},{"$f":"Wiese_Silage!M48","v":42.857142857142854},{"$f":"K9-(F9*Cosubstrate!K26)","v":277.05}]
["Tierhaltung ","Rinder "]
{"$rows_left_out":7}
{"sheet":"TierischeSubstrate","index":7,"n_rows":27,"n_cols":13,"rows_kept":27,"cut":false,"hidden":false,"merged":[]}
[null,"7. Tierische Substrate:"]
[]
[null,"Tierische Reststoffe:"]
[null,"Substrat:","TS ","oTS","Anfall","Anfall","Gasausbeute ","Raum-Gew.","Gasausbeute","Gasausbeute","Methangehalt","Verweilzeit","TS-Abbau"]
[null,null,"%","%","m³/GV","dt/GV","m³/kg oTS","dt/m³","m³/GV *d","m³ CH4/kg oTS","%","Tage","%"]
[null,"Junghennen (Käfig), Gülle",0.22,0.76,19.2,180,0.48,9.4,{"$f":"F6/365*100*C6*D6*G6","v":3.9578301369863005},0.3,{"$f":"J6/G6","v":0.625},25,0.4]
[null,"Legehennen (Käfig), Gülle",0.22,0.76,18,161,0.48,8.9,3.5400591780821919,0.3,{"$f":"J7/G7","v":0.625},25,0.4]
[null,"Broiler (Bodenh.), Mist",0.6,0.75,9.6,78,0.55000000000000004,8.1,5.2890410958904113,0.34,0.61818181818181817,25,0.4]
[null,"Mastputen (Bodenh.), Mist",0.6,0.75,14.3,114,0.55000000000000004,7.9,7.7301369863013702,0.34,0.61818181818181817,25,0.4]
[null,"Junghennen (Bodenh.), Mist",0.6,0.75,9,66,0.55000000000000004,7.3,4.4753424657534246,0.34,0.61818181818181817,25,0.4]
{"$rows_left_out":18}
{"sheet":"Cosubstrate","index":8,"n_rows":5475,"n_cols":15,"rows_kept":5475,"cut":false,"hidden":false,"merged":[]}
["6. Co-Substrate:",null,null,null,null,null,null,null,null,null,null,"Düngerpreise:"]
["Zusammenstellung von Gärsubstraten:",null,null,null,null,null,null,null,null,null,null,0.65,0.64,0.32]
[1,2,3,4,5,6,7,8,9,10,11,12,13,14,15]
["Substrat:","TS ","oTS","Gasausbeute ","R-Gew.","Prämien","variable","Methangehalt","Methangehalt","Verweilzeit","TS-Abbau","N","P2O5","K2O","Düngerwert:"]
[null,"%","%","m³/kg oTS","dt/m³",null,"Kosten","m³ CH4/kg oTS","%","Tage","%","kg/ha","kg/ha","kg/ha","€/ha"]
["Altbrot",0.9,0.97,0.8,5,0,0,0.6,{"$f":"H6/D6","v":0.74999999999999989},20,0.7]
["Apfelschlempe",0.03,0.95,0.53,9,0,0,0.33,{"$f":"H7/D7","v":0.62264150943396224},20,0.5]
["Apfeltrester",0.25,0.86,0.7,7.5,0,0,0.33,0.47142857142857147,20,0.5]
["Biertreber",0.25,0.66,0.7,7.5,0,0,0.38,0.54285714285714293,20,0.5]
["Bioabfall",0.67500000000000004,0.5,0.65,4,0,0,0.4,0.61538461538461542,20,0.5]
{"$rows_left_out":5466}
{"sheet":"Mastschweine","index":9,"n_rows":80,"n_cols":22,"rows_kept":80,"cut":false,"hidden":false,"merged":[[2,10,2,13],[2,14,2,17],[69,4,78,4]]}
[{"$f":"CELL(\"row\",A1)","v":1},null,"Deckungsbeitragsrechnung für:",null,null,null,null,null,null,null,"Mastschweine (DLxDExPi)",null,null,null,"Einheit: 1","Platz",null,"< Formular 1 >",null,"Währung:","€"]
[2]
[3,null,null,null,null,null,null,null,null,null,"Mastschwein I",null,null,null,"Mastschwein II"]
[4,null,null,"Gewicht am Anfang & Ende",null,null,null,null,null,null,28,"kg (Anf.)",112,"kg (Ende)",28,"kg (Anf.)",112,"kg (Ende)"]
[5,null,null,"Zuwachs gesamt & je Tag",null,null,null,null,null,null,{"$f":"M4-K4","v":84},"kg ges.",{"$f":"IF(K6=0,0,K5*1000/K6)","v":700},"g / Tag",{"$f":"Q4-O4","v":84},"kg ges.",{"$f":"IF(O6=0,0,O5*1000/O6)","v":750},"g / Tag"]
[6,null,null,"Mastdauer & Leerzeit je Umtrieb",null,null,null,null,null,null,120,"Tage",7,"Tage",112,"Tage",5,"Tage"]
[7,null,null,"Umtriebsdauer und Futterverwertung",null,null,null,null,null,null,{"$f":"K6+M6","v":127},"Tage",2.8,":1 kg",{"$f":"O6+Q6","v":117},"Tage",2.7,":1 kg"]
[8,null,null,"Vermarktungsgewicht & Mast-Verluste",null,null,null,null,null,null,80,"%v.Endgew.",3,"% Verl.",80,"%v.Endgew.",2,"% Verl."," Das Vermarktungsgewicht wird in % des Endgewichts angegeben:  bei Lebendvermarktung z.B. 98% (2% Nüchterung), bei Geschlachtetvermarktung z.B. 80% (Ausschlachtung)"]
[9,null,null,"Tiere & GV je Einheit",null,null,null,null,null,null,{"$f":"IF(K7=0,0,365/K7)","v":2.8740157480314958},"Tiere/Einh.",{"$f":"((M4+K4)/2)/500","v":0.14000000000000001},"GV/Einh.",{"$f":"IF(O7=0,0,365/O7)","v":3.1196581196581197},"Tiere/Einh.",{"$f":"((Q4+O4)/2)/500","v":0.14000000000000001},"GV/Einh."]
[10]
{"$rows_left_out":71}
{"sheet":"Wiese_Silage","index":10,"n_rows":66,"n_cols":25,"rows_kept":66,"cut":false,"hidden":false,"merged":[]}
[null,1,"Tabelle 6:    Deckungsbeitragsrechnung für:",null,null,null,null,null,null,null,null,{"$f":"K3","v":"Wiese-Silage"},null,null,"Einheit: 1","ha"]
[null,{"$f":"1+B1","v":2}]
[null,3,null,null,null,null,null,null,null,null,"Wiese-Silage"]
[null,4,"Energieertrag",null,null,null,null,null,null,null,"%T Grüng.","%T Futter","MJ / dt","%T Grüng.","%T Futter","MJ / dt"]
[null,5,null,"TM- & Energiekonzentration",null,null,null,null,null,null,0.18,0.35,140,null,null,null,null,null,64064]
[null,6,null,null,null,null,null,null,null,"Einh.","Brutto","Verluste","Netto","Brutto","Verluste","Netto",null,null,{"$f":"K9","v":42000}]
[null,7,null,"Brutto-Grüngut / Netto-Futter",null,null,null,null,null,"dt",300,"-  ",{"$f":"IF(L5=0,0,M8/L5)","v":131.14285714285714},null,"-  ",{"$f":"IF(O5=0,0,P8/O5)","v":0},null,null,{"$f":"S5/S6","v":1.5253333333333334}]
[null,8,null,"Trockenmasse",null,null,null,null,null,"dt",{"$f":"K7*K5","v":54},0.15,{"$f":"K8*(1-L8)","v":45.9},{"$f":"N7*N5","v":0},null,{"$f":"N8*(1-O8)","v":0}]
[null,9,null,"Energie",null,null,"NEL",null,null,"MJ",{"$f":"K7*M5","v":42000},0.2,{"$f":"K9*(1-L9)","v":33600},{"$f":"N7*P5","v":0},null,{"$f":"N9*(1-O9)","v":0}]
[null,10,"Einstreu",null,null,null,null,null,null,"dt",null,null,{"$f":"K10*(1-L10)","v":0},null,null,{"$f":"N10*(1-O10)","v":0}]
{"$rows_left_out":57}
{"sheet":"Grünroggen","index":11,"n_rows":65,"n_cols":19,"rows_kept":65,"cut":false,"hidden":false,"merged":[[2,10,2,12],[2,13,2,15]]}
[{"$f":"CELL(\"row\",A1)","v":1},null,"Deckungsbeitragsrechnung für:",null,null,null,null,null,null,null,"Silomais",null,"Einheit: 1","ha",null,"< Formular 1 >",null,"Währung:","€"]
[{"$f":"CELL(\"row\",A2)","v":2}]
[3,null,null,null,null,null,null,null,null,null,"Grünroggen"]
[4,null,"Energieertrag",null,null,null,null,null,null,null,"%T Grüng.","%T Futter","% T-Verl.","%T Grüng.","%T Futter","% T-Verl."]
[5,null,null,"TM-Gehalte und -verluste",null,null,null,null,null,null,0.22,0.22,0.1]
[6,null,null,null,null,null,null,null,null,"Einh.","Brutto","Gehalte","Netto","Brutto","Gehalte","Netto"]
[7,null,null,"Brutto-Grüngut / Netto-Futter",null,null,null,null,null,"dt",250,"-  ",{"$f":"IF(L5=0,0,M8/L5)","v":225},null,"-  ",{"$f":"IF(O5=0,0,P8/O5)","v":0}]
[8,null,null,"Trockenmasse",null,null,null,null,null,"dt",{"$f":"K7*K5","v":55},"-  ",{"$f":"K8*(1-M5)","v":49.5},{"$f":"N7*N5","v":0},"-  ",{"$f":"N8*(1-P5)","v":0}]
[9,null,null,"Energie",null,null,"MJ NEL / dt T netto",null,null,"MJ",null,null,{"$f":"L9*M$8","v":0},null,null,{"$f":"O9*P$8","v":0}," Wenn die Nährstoffgehalte auf Frischmasse-Basis angegeben werden,"]
[10,null,null,null,null,null,"MJ ME  / dt T netto",null,null,"MJ",null,null,{"$f":"L10*M$8","v":0},null,null,{"$f":"O10*P$8","v":0}," müssen die Formeln für die Gesamtnährstofferträge geändert werden!"]
{"$rows_left_out":56}
{"sheet":"Getreide - GPS ","index":12,"n_rows":65,"n_cols":19,"rows_kept":65,"cut":false,"hidden":false,"merged":[[2,10,2,12],[2,13,2,15]]}
[{"$f":"CELL(\"row\",A1)","v":1},null,"Deckungsbeitragsrechnung für:",null,null,null,null,null,null,null,"Silomais",null,"Einheit: 1","ha",null,"< Formular 1 >",null,"Währung:","€"]
[2]
[3,null,null,null,null,null,null,null,null,null,"Silomais 450",null,null,"Silomais 550"]
[4,null,"Energieertrag",null,null,null,null,null,null,null,"%T Grüng.","%T Futter","% T-Verl.","%T Grüng.","%T Futter","% T-Verl."]
[5,null,null,"TM-Gehalte und -verluste",null,null,null,null,null,null,0.35,0.35,0.1]
[6,null,null,null,null,null,null,null,null,"Einh.","Brutto","Gehalte","Netto","Brutto","Gehalte","Netto"]
[7,null,null,"Brutto-Grüngut / Netto-Futter",null,null,null,null,null,"dt",350,"-  ",{"$f":"IF(L5=0,0,M8/L5)","v":315},null,"-  ",{"$f":"IF(O5=0,0,P8/O5)","v":0}]
[8,null,null,"Trockenmasse",null,null,null,null,null,"dt",{"$f":"K7*K5","v":122.49999999999999},"-  ",{"$f":"K8*(1-M5)","v":110.24999999999999},{"$f":"N7*N5","v":0},"-  ",{"$f":"N8*(1-P5)","v":0}]
[9,null,null,"Energie",null,null,"MJ NEL / dt T netto",null,null,"MJ",null,null,{"$f":"L9*M$8","v":0},null,null,{"$f":"O9*P$8","v":0}," Wenn die Nährstoffgehalte auf Frischmasse-Basis angegeben werden,"]
[10,null,null,null,null,null,"MJ ME  / dt T netto",null,null,"MJ",null,null,{"$f":"L10*M$8","v":0},null,null,{"$f":"O10*P$8","v":0}," müssen die Formeln für die Gesamtnährstofferträge geändert werden!"]
{"$rows_left_out":56}
{"sheet":"Silomais ","index":13,"n_rows":65,"n_cols":19,"rows_kept":65,"cut":false,"hidden":false,"merged":[[2,10,2,12],[2,13,2,15]]}
[{"$f":"CELL(\"row\",A1)","v":1},null,"Deckungsbeitragsrechnung für:",null,null,null,null,null,null,null,"Silomais",null,"Einheit: 1","ha",null,"< Formular 1 >",null,"Währung:","€"]
[2]
[3,null,null,null,null,null,null,null,null,null,"Silomais 450",null,null,"Silomais 550"]
[4,null,"Energieertrag",null,null,null,null,null,null,null,"%T Grüng.","%T Futter","% T-Verl.","%T Grüng.","%T Futter","% T-Verl."]
[5,null,null,"TM-Gehalte und -verluste",null,null,null,null,null,null,0.3,0.3,0.1]
[6,null,null,null,null,null,null,null,null,"Einh.","Brutto","Gehalte","Netto","Brutto","Gehalte","Netto"]
[7,null,null,"Brutto-Grüngut / Netto-Futter",null,null,null,null,null,"dt",450,"-  ",{"$f":"IF(L5=0,0,M8/L5)","v":405},null,"-  ",{"$f":"IF(O5=0,0,P8/O5)","v":0}]
[8,null,null,"Trockenmasse",null,null,null,null,null,"dt",{"$f":"K7*K5","v":135},"-  ",{"$f":"K8*(1-M5)","v":121.5},{"$f":"N7*N5","v":0},"-  ",{"$f":"N8*(1-P5)","v":0}]
[9,null,null,"Energie",null,null,"MJ NEL / dt T netto",null,null,"MJ",null,null,{"$f":"L9*M$8","v":0},null,null,{"$f":"O9*P$8","v":0}," Wenn die Nährstoffgehalte auf Frischmasse-Basis angegeben werden,"]
[10,null,null,null,null,null,"MJ ME  / dt T netto",null,null,"MJ",null,null,{"$f":"L10*M$8","v":0},null,null,{"$f":"O10*P$8","v":0}," müssen die Formeln für die Gesamtnährstofferträge geändert werden!"]
{"$rows_left_out":55}