{"text_format":"2","workbook":"xlsx","n_sheets":4,"sheets":["Table rentabilité","Remboursement Mensualités","investissement réel","Modèles envisagés (ex.arachide)"],"not_rendered":{"charts":0,"images":1,"macros":0,"external_links":0,"defined_names":0,"comments":0,"pivot_tables":0},"unopened":[],"bounds":{"document_bytes":16777216,"sheet_cells":100000,"run_cost":"one","rows_first":2000,"rows_last":500,"rows_between":2000,"halvings":0,"cell_chars":16384,"cell_head_chars":4096},"cells_cut":0,"cells_raw":0,"read":"whole","date_system":"1900"}

{"sheet":"Table rentabilité","index":0,"n_rows":219,"n_cols":23,"rows_kept":219,"cut":false,"hidden":false,"merged":[[62,1,63,1],[62,7,63,7],[64,1,65,1],[64,7,65,7],[23,3,24,3],[23,2,24,2],[23,5,24,5],[23,7,24,7],[23,6,24,6],[23,11,24,11],[23,8,24,8],[16,6,17,6],[23,9,23,10],[81,5,81,6],[16,10,17,10],[69,5,69,6],[16,8,16,9],[156,2,156,3],[16,2,17,2],[16,3,16,4],[16,5,17,5],[16,7,17,7],[79,5,79,6],[74,5,74,6],[119,2,119,3],[83,5,83,6],[91,5,91,6],[23,4,24,4]]}
[]
[null,"ETUDE RENTABILITE SOLUTIONS USAGE PRODUCTIF"]
[null,"PRESSE A HUILE BAOBAB & MORINGA"]
[]
[null,"Dimmensionnement réel"]
[null,"Dimmensionnement optimisé "]
[null,"Dimmensionnement réel"]
[]
[]
[null,"Cases à vérifier"]
[null,"Cases à compléter"]
[null,"Cases à laisser vides"]
[null,"Cases calculées"]
[]
[null,"Caractéristiques techniques du Projet"]
[]
[null,"Usage Productif","Rendement (kg/heure)","Puissance (kW)",null,"Prix (FCFA)","Energie consommée (KWh/j)","Energie à produire (kWh/j)","Fonctionnement optimal",null,"Coefficient déperdition (k)"]
[null,null,null,"Projet","Nominale",null,null,null,"heures par jour","jours à l'année"]
[null,"Presse KK baobab",{"$f":"IF(F81=\"Oui\",G26*60/H26,G27*60/H27)","v":10},0.5,0.5,1967871,{"$f":"IF(F81=\"Oui\",F26*I19*60/H26,F27*I19*60/H27)+1.2","v":3.42},{"$f":"G19/K19","v":6.2181818181818178},{"$f":"F71*F72","v":3},320,0.55000000000000004]
[null,"Presse KK moringa",{"$f":"G28*60/H28","v":2.6666666666666665},0.2,0.2,1967871,{"$f":"(F28*I20*60/H28)+1.2","v":2.5359999999999996},{"$f":"G20/K20","v":4.6109090909090895},{"$f":"F71*G72","v":3},320,0.55000000000000004]
[null,"Dépulpeuse électrique"]
[null,"Moulin solaire",50,null,2,500000,{"$f":"I22*E22","v":2},{"$f":"I22*E22/K22","v":3.3333333333333335},{"$f":"(C19*I19)/(C22*K22)","v":1},null,0.6]
[]
[null,"Huile","Vitesse rotation","Taille buse","Graine ou poudre","Energie (kWh)","Quantité (Kg)","Temps pressage (Min)","Densité","Teneur",null,"Rendement huile (L/kg)"]
[{"$nulls":9},"Huile","Tourteaux"]
[null,"Baobab",50,"16 ou sans","Poudre",7.3999999999999996E-2,1,6,0.91600000000000004,0.09,{"$f":"100%-J26","v":0.91},{"$f":"I26*J26","v":8.2439999999999999E-2}]
[null,"Baobab",50,"16 ou sans","Graines",0.11,1,10,0.91600000000000004,0.05,{"$f":"100%-J27","v":0.95},{"$f":"I27*J27","v":4.5800000000000007E-2}]
[null,"Moringa",50,16,"Graines",0.33400000000000002,2,45,0.90800000000000003,0.25,{"$f":"100%-J28","v":0.75},{"$f":"I28*J28","v":0.22700000000000001}]
[]
[null,"Equipements facultatifs/facultatifs"]
[null,"designation","nombre","prix"]
[null,"Moulin solaire",1,750000]
[null,"Dépulpeuse",1]
[null,"Séchoir solaire",1,3800000]
[null,"Démarreur ",1,147000]
[null,"parafoudre",1,140000]
[null,"Filtre huile",2,100000]
[null,"local",1,1000000]
[null,"Installation",1,1000000]
[null,"Autre: FRA, codes barres, etc.",1,750000]
[null,"Support modules",18,35000]
[null,"Câbles et accessoires ",1,240000]
[null,"Système alimentation continue ",0,0]
[null,"Système de décantation",0,0]
[null,"Certifications (bio, etc.)",0,0]
[]
[null,"Alimentation Solaire","Puissance (kW)","Prix (FCFA)","Coefficient déperdition","Tension (V)",null,"Batteries","Capacité (Ampères/h)","Prix (FCFA)","Tension (V)","Durée de vie*","* en conditions optimales, annoncées constructeur"]
[null,"module polycristatllin 270 Wc",0.27,74750,0.6,"24V",null,"Victron Energy Gel",220,400000,12,10]
[null,"Sharp ND-AC275",0.27500000000000002,80000,0.6,"24V",null,"Victron ",265,327957,12,10]
[null,"BlueSolar SPM-300-24 Monocristallin",0.375,78500,0.6,"24V",null,"Batteries OPZS 1220 (Ah)",1220,194400,2,7]
[{"$nulls":7},"Tension nécessaire système",{"$f":"IF(J51<0.5,12,IF(AND(J51>=0.5,J51<2),24,IF(J51>=2,48)))","v":48},{"$f":"F98*INDEX(C:C,MATCH(F76,B:B,0))","v":4.95}]
[]
[null,"Onduleur","kVa","Prix (FCFA)",null,null,null,"Régulateur","tension(V)_courant(A)","Prix (FCFA)","Tension (V)"]
[null,"Vitron Energy Phoenix",3,450000,null,null,null,"BlueSolar 150V 35A de Victron Energy","150_35",220000,"12V/24V/48V"]
[null,"Victron quatro 5 kW",5,1426500,null,null,null,"victron","100_50",114700,"12V/24V/48V"]
[null,"Xtender",{"$nulls":5},"victron","150_45",650000,"12V/24V/48V"]
[]
[null,"Irradiation Solaire"]
[null,"Month ","Jan ","Feb ","Mar ","Apr ","May ","Jun ","Jul ","Aug ","Sep ","Oct ","Nov ","Dec ","Year"]
[null,"H(15)*",5.12,5.75,6.37,6.61,6.34,6.05,6.26,5.51,6.03,5.81,5.226,5.03,{"$f":"IF('Table rentabilité'!G87=\"x\",MAX(C60:N60),IF('Table rentabilité'!G88=\"x\",MIN(C60:N60),IF('Table rentabilité'!G89=\"x\",AVERAGE(C60:N60),\"erreur\")))","v":5.8421666666666674}]
[]
[null,"Électricité du réseau",null,"1ère Tranche","2ème Tranche","3ème Tranche",null,null,null,"1ère Tranche","2ème Tranche","3ème Tranche","Total"]
[null,"UP-Petite Puissance","Tranche (KWh)",50,500,"∞",null,"UP-Petite Puissance","Energie par Tranche",{"$f":"(F91*30)-SUM(K63:L63)","v":50},{"$f":"IF((F91*30)>D63,(F91*30)-D63-L63,0)","v":188.67999999999998},{"$f":"IF((F91*30)>E63,(F91*30)-E63,0)","v":0},{"$f":"SUM(J63:L63)","v":238.67999999999998}]
[null,null,"Prix (KWh)",128.85,135.68,147.68,null,null,"Coût (FCFA)",{"$f":"J63*D64","v":6442.5},{"$f":"K63*E64","v":25600.1024},{"$f":"L63*F64","v":0},{"$f":"SUM(J64:L64)","v":32042.6024}]
[null,"UP-Moyenne Puissance","Tranche",100,500,"∞",null,"UP-Moyenne Puissance","Energie par Tranche",{"$f":"(F91*30)-SUM(K65:L65)","v":100},{"$f":"IF((F91*30)>D65,(F91*30)-D65-L65,0)","v":138.67999999999998},{"$f":"IF((F91*30)>E65,(F91*30)-E65,0)","v":0},238.67999999999998]
[null,null,"Prix (KWh)",129.81,136.53,149.24,null,null,"Coût (FCFA)",{"$f":"J65*D66","v":12981},{"$f":"K65*E66","v":18933.980399999997},0,31914.980399999997]
[]
[null,"Choix de dimensionnement du projet"]
[]
[null,"Production min. souhaitée (kg graine/jour)",null,null,null,30]
[null,"Temps de fonctionnement (heures)",null,null,null,6]
[null,"Ratio Baobab/Moringa",null,null,null,0.5,{"$f":"100%-F72","v":0.5}]
[null,"Part des graines dans le poids total du fruit de baobab",null,null,null,0.75]
[]
[null,"Choix de la presse",null,null,null,"Presse KK baobab"]
[null,"Choix de l'alimentation solaire",null,null,null,"Sharp ND-AC275"]
[null,"Choix du système de stokage",null,null,null,"Victron Energy Gel"]
[null,"Choix de l'onduleur",null,null,null,"Vitron Energy Phoenix"]
[null,"Choix du régulateur",null,null,null,"BlueSolar 150V 35A de Victron Energy"]
[null,"Choix décortiqueuse solaire"]
{"$rows_left_out":140}
{"sheet":"Remboursement Mensualités","index":1,"n_rows":133,"n_cols":7,"rows_kept":133,"cut":false,"hidden":true,"merged":[]}
["Remboursement de prêt"]
["Taux annuel",{"$f":"'Table rentabilité'!D190","v":0.12}]
["Capital emprunté",{"$f":"'Table rentabilité'!D189","v":23848885.747918904}]
["Durée du prêt (en année)",{"$f":"'Table rentabilité'!D191","v":2},{"$f":"B4*12","v":24}]
["Mensualité à régler",{"$f":"-PMT((1+B2)^(1/12)-1,B4*12,B3)","v":1115829.9160295804},"Formule mensualité","=-VPM((1+B2)^(1/12)-1;B4*12;B3)"]
[]
["Décomposition de la mensualité"]
["Remboursement du principal",{"$f":"-PPMT((1+B2)^(1/12)-1,1,B4*12,B3)","v":889532.77744704916},"Formule principal","=-PRINCPER((1+B2)^(1/12)-1;1;B4*12;B3)"]
["Remboursement des interêts",{"$f":"-IPMT((1+B2)^(1/12)-1,1,B4*12,B3)","v":226297.13858253119},"Formule intérêt","=-INTPER((1+B2)^(1/12)-1;1;B4*12;B3)"]
[]
[]
["Dans les formules ci-dessous Taux de période = TP =  (1+$B$2)^(1/12)-1"]
["Périodes","Mensualité","Capital","Intérêts","Reste (ou résiduel)","Années"]
[{"$f":"IF(B4<>0,1,\"-\")","v":1},{"$f":"IF(A14<>\"-\",C14+D14,\"\")","v":1115829.9160295804},{"$f":"IF(A14<>\"-\",-PPMT((1+$B$2)^(1/12)-1,A14,$B$4*12,$B$3),\"\")","v":889532.77744704916},{"$f":"IF(A14<>\"-\",-IPMT((1+$B$2)^(1/12)-1,A14,$B$4*12,$B$3),\"\")","v":226297.13858253119},{"$f":"IF(A14<>\"-\",$B$3+CUMPRINC((1+$B$2)^(1/12)-1,$B$4*12,$B$3,1,A14,0),\"\")","v":22959352.970471855},{"$f":"IF(A14<>\"-\",1,\"\")","v":1},{"$f":"IF(A14<>\"-\",1,\"\")","v":1}]
[{"$f":"IF(AND($B$4<>0,A14<$C$4),A14+1,\"-\")","v":2},{"$f":"IF(A15<>\"-\",C15+D15,\"\")","v":1115829.9160295804},{"$f":"IF(A15<>\"-\",-PPMT((1+$B$2)^(1/12)-1,A15,$B$4*12,$B$3),\"\")","v":897973.36978076864},{"$f":"IF(A15<>\"-\",-IPMT((1+$B$2)^(1/12)-1,A15,$B$4*12,$B$3),\"\")","v":217856.54624881165},{"$f":"IF(A15<>\"-\",$B$3+CUMPRINC((1+$B$2)^(1/12)-1,$B$4*12,$B$3,1,A15,0),\"\")","v":22061379.600691088},{"$f":"IF(A15<>\"-\",IF(G14<G15,F14,F14+1),\"\")","v":1},{"$f":"IF(A15=\"-\",\"\",IF(G14<12,G14+1,1))","v":2}]
[{"$f":"IF(AND($B$4<>0,A15<$C$4),A15+1,\"-\")","v":3},1115829.9160295804,906494.05314738827,209335.86288219216,21154885.547543697,{"$f":"IF(A16<>\"-\",IF(G15<G16,F15,F15+1),\"\")","v":1},{"$f":"IF(A16=\"-\",\"\",IF(G15<12,G15+1,1))","v":3}]
[4,1115829.9160295802,915095.58751413459,200734.32851544567,20239789.960029565,1,4]
[5,1115829.9160295804,923778.74005940696,192051.17597017341,19316011.219970156,1,5]
[6,1115829.9160295804,932544.28524120071,183285.63078837964,18383466.934728954,1,6]
[7,1115829.9160295804,941393.00486618327,174436.91116339716,17442073.929862771,1,7]
[8,1115829.9160295804,950325.68815942341,165504.22787015705,16491748.241703348,1,8]
[9,1115829.9160295804,959343.13183478324,156486.78419479713,15532405.109868564,1,9]
[10,1115829.9160295804,968446.14016597788,147383.7758636025,14563958.969702585,1,10]
[11,1115829.9160295804,977635.52505830908,138194.39097127129,13586323.444644278,1,11]
[12,1115829.9160295804,986912.10612107976,128917.80990850065,12599411.338523198,1,12]
[13,1115829.9160295804,996276.71074069594,119553.20528888448,11603134.627782501,2,1]
[14,1115829.9160295804,1005730.1741544618,110099.74187511852,10597404.453628041,2,2]
[15,1115829.9160295804,1015273.3395250756,100556.57650450469,9582131.1141029634,2,3]
[16,1115829.9160295804,1024907.0580158317,90922.858013748599,8557224.0560871307,2,4]
[17,1115829.9160295804,1034632.1888665366,81197.727163043688,7522591.8672205973,2,5]
[18,1115829.9160295804,1044449.5994701457,71380.316559434694,6478142.2677504495,2,6]
[19,1115829.9160295804,1054360.1654501262,61469.750579454289,5423782.1023003273,2,7]
[20,1115829.9160295802,1064364.7707385549,51465.145291025336,4359417.3315617703,2,8]
[21,1115829.9160295802,1074464.307654958,41365.608374622207,3284953.0239068121,2,9]
[22,1115829.9160295804,1084659.6769858962,31170.239043684182,2200293.3469209112,2,10]
[23,1115829.9160295804,1094951.7880653071,20878.127964273281,1105341.5588556081,2,11]
[24,1115829.9160295804,1105341.5588556102,10488.357173970124,0,2,12]
["-","","","","","",""]
["-","","","","","",""]
["-","","","","","",""]
["-","","","","","",""]
["-","","","","","",""]
["-","","","","","",""]
["-","","","","","",""]
["-","","","","","",""]
["-","","","","","",""]
["-","","","","","",""]
["-","","","","","",""]
["-","","","","","",""]
["-","","","","","",""]
["-","","","","","",""]
["-","","","","","",""]
["-","","","","","",""]
["-","","","","","",""]
["-","","","","","",""]
["-","","","","","",""]
["-","","","","","",""]
["-","","","","","",""]
["-","","","","","",""]
["-","","","","","",""]
["-","","","","","",""]
["-","","","","","",""]
["-","","","","","",""]
["-","","","","","",""]
["-","","","","","",""]
["-","","","","","",""]
["-","","","","","",""]
["-","","","","","",""]
["-","","","","","",""]
["-","","","","","",""]
["-","","","","","",""]
["-","","","","","",""]
["-","","","","","",""]
["-","","","","","",""]
["-","","","","","",""]
["-","","","","","",""]
["-","","","","","",""]
["-","","","","","",""]
["-",{"$f":"IF(A79<>\"-\",C79+D79,\"\")","v":""},{"$f":"IF(A79<>\"-\",-PPMT((1+$B$2)^(1/12)-1,A79,$B$4*12,$B$3),\"\")","v":""},{"$f":"IF(A79<>\"-\",-IPMT((1+$B$2)^(1/12)-1,A79,$B$4*12,$B$3),\"\")","v":""},{"$f":"IF(A79<>\"-\",$B$3+CUMPRINC((1+$B$2)^(1/12)-1,$B$4*12,$B$3,1,A79,0),\"\")","v":""},"",""]
[{"$f":"IF(AND($B$4<>0,A79<$C$4),A79+1,\"-\")","v":"-"},"","","","",{"$f":"IF(A80<>\"-\",IF(G79<G80,F79,F79+1),\"\")","v":""},{"$f":"IF(A80=\"-\",\"\",IF(G79<12,G79+1,1))","v":""}]
{"$rows_left_out":54}
{"sheet":"investissement réel","index":2,"n_rows":23,"n_cols":7,"rows_kept":23,"cut":false,"hidden":false,"merged":[]}
[]
[]
[null,"Désignation ","Quantité","Prix unitaire TTC","Montant Total TTC","Durée de vie (an)","Amortissement annuel"]
[null,"Presse",1,1967871,{"$f":"C4*D4","v":1967871},10,{"$f":"E4/F4","v":196787.1}]
[null,"Moulin solaire",1,750000,{"$f":"C5*D5","v":750000},15,{"$f":"E5/F5","v":50000}]
[null,"Dépulpeuse",1,0,0,10,0]
[null,"Séchoir solaire",1,3800000,3800000,15,253333.33333333334]
[null,"Modules PV ",18,250000,{"$f":"C8*D8","v":4500000},20,225000]
[null,"Batterie ",8,400000,3200000,6.0000000000000009,533333.33333333326]
[null,"Régulateur ",1,220000,220000,10,22000]
[null,"Onduleur chargeur  ",1,450000,{"$f":"C11*D11","v":450000},10,{"$f":"E11/F11","v":45000}]
[null,"Support aluminium",18,35000,630000,20,31500]
[null,"Démarreur ",1,147000,147000,15,9800]
[null,"Parafoudre ",1,140000,140000,15,9333.3333333333339]
[null,"Câbles et accessoires ",1,240000,240000,20,12000]
[null,"Système alimentation continue ",0,0,{"$f":"C16*D16","v":0},15,0]
[null,"Système de décantation",2,0,0]
[null,"Filtre Huile",2,100000,200000,1,200000]
[null,"Local",1,1000000,1000000,0]
[null,"Installation",1,1000000,1000000,20]
[null,"Certifications (bio, etc.)",0,0,{"$f":"C21*D21","v":0},0]
[null,"Autre: FRA, codes barres, etc.",1,750000,750000,0]
[null," TOTAL (F CFA) ",null,null,{"$f":"SUM(E4:E22)","v":18994871},null,{"$f":"SUM(G4:G22)","v":1588087.0999999999}]

{"sheet":"Modèles envisagés (ex.arachide)","index":3,"n_rows":71,"n_cols":15,"rows_kept":71,"cut":false,"hidden":true,"merged":[[11,12,11,16],[12,12,12,16],[11,4,11,9],[12,4,12,9]]}
[]
[null,"Analyse économique"]
[]
[]
[null,"Contexte",null,"Les producteurs d'arachides sont dépendants du prix de rachat de leurs graines désormais fixé par l'Etat mais qui doit premettre à la filière de rester compétitive notamment face aux autres huiles importées"]
[null,null,null,"Des intermédiaires ont envahis le marché, les opérateurs privés de stockage (OPS) qui achètent souvent à très bas prix les productions d'arachide qui doivent être écoulées (en-dessous du prix de l'Etat)"]
[null,null,null,"La transformation artisanale de l'arachide brute en huile est en plein essor car elle permet de générer un revenu supplémentaire dans les bassins arachidiers"]
[null,null,null,"La transformation de l'arachide en huile au niveau artisanal a souvent été freinée par des problèmes importants: impossibilité de stocker la production d'arachide, développement de maladies (aflatoxine notamment), concurrence élevée des industriels, etc."]
[]
[]
[]
[null,"SWOT",null,"Forces","> Potentiel de développement économique local important: augmentation nette des gains potentiels de revenus liés à la revente d'une huile brute pour la consommation locale. Avec un prix de vente situé entre le prix de l'huile brute à destination des raffineurs et de l'huile raffinée mise sur le marché (entre 800 et 1200 FCFA), le gain de CA par kilo d'arachide se situe entre 70 FCFA et 250 FCFA.\n\n> Qualité de l'huile brute peut être améliorée sensiblement avec les moyens techniques d'une presse solaire. Notamment pour lutter contre l'aflatoxine. L'ajout de filtres peut encore augmenter cette qualité et rapprocher le produit de l'huile raffinée.\n\n> la capacité de traitement de la presse solaire par rapport à la presse manuelle résout un certain nombre de problèmes liés au stockage de la graine",{"$nulls":6},"Faiblesses","> Le projet a des gains marginaux peu élevés. Sa rentabilité passe donc par un fonctionnement intensif et un apport important de matière première qui n'est pas garanti. Par ailleurs, sa durée d'amortissement peut être longue et une toute variation des prix sur le marché de l'arachide peut l'affecter durablement\n\n> Il n'existe pas de projets de référence similaires qui peuvent donner des indications claires sur la durabilité et la rentabilité de la solution"]
[null,null,null,"Opportunités","> Les transformateurs artisanaux d'huile d'arachide sont déjà nombreux et le métier n'est pas nouveau. L'exploitation de l'avantage comparatif de la technologie solaire pourra donc rapidement porter ses fruits\n\n> Il existe une demande locale d'huile d'arachide de meilleure qualité et économiquement attrayante: l'huile d'arachide est adaptée à la cuisine sénégalaise et la diminution des risques sanitaires la rendent à nouveau attrayante.\n\n",{"$nulls":6},"Menaces","> Le marché de l'huile d'arachide est un marché complexe: le challenge est économique plus que technologique. Les acteurs devront être accompagnés pour trouver les fournisseurs d'arachide et être capable de regrouper les productions et trouver les débouchés au niveau de la vente de l'huile brute.\n\n> Le marché est composé d'acteurs multiples et aux intérêts économiques importants. Le risque est élevé pour les bénéficiaires du projet de subir la concurrence aussi bien loyale des industriels et déloyale des OPS"]
[]
[null,"Modèles économiques"]
[]
[]
[null,null,"Modèle 1",{"$nulls":7},"Modèle 2"]
[null,null,"Business de transformation",{"$nulls":7},"Business de transformation"]
[]
[null,null,"Intrant","Graine décortiquée rachetée aux producteurs",{"$nulls":6},"Intrant","Graine non décortiquée rachetée aux producteurs"]
[null,null,"Extrant","Revente d'une l'huile non raffinée aux particuliers",{"$nulls":6},"Extrant","Revente d'une l'huile non raffinée aux particuliers"]
[]
[{"$nulls":5},"Solution 1","Solution 2",{"$nulls":6},"Solution 1","Solution 2"]
[null,null,"Nb presses",null,null,1,2,null,null,null,"Nb presses",null,null,1,2]
[null,null,"Profitabilité",null,null,"3ème année","1ère année",null,null,null,"Profitabilité",null,null,"1ère année","1ère année"]
[null,null,"Intrant arachide min (kg)",null,null,"20,2 T","33,6 T",null,null,null,"Intrant arachide min (kg)",null,null,"10,1 T","13,4 T"]
[null,null,"Fonctionnement presse min (heures/jour)",null,null,12,10,null,null,null,"Fonctionnement presse min (heures/jour)",null,null,6,4]
[null,null,"Prix achat arachide décortiquée maximum",null,null,375,400,null,null,null,"Prix achat arachide décortiquée maximum",null,null,220,220]
[null,null,"Prix vente huile brute minimum",null,null,1000,1000,null,null,null,"Prix vente huile brute minimum",null,null,1000,1000]
[null,null,"Prix de vente tourteaux minimum",null,null,200,200,null,null,null,"Prix de vente tourteaux minimum",null,null,200,200]
[null,null,"Bénéfice min cumulé sur 5 ans",null,null,297672,2395840,null,null,null,"Bénéfice min cumulé sur 5 ans",null,null,1385014,3016369]
[null,null,"Bénéfice min cumulé sur 9 ans",null,null,8653293.6653214898,16706237.692609798,null,null,null,"Bénéfice min cumulé sur 9 ans",null,null,7186440.3045057058,11988417]
[]
[null,null,"Alerte:","Incapacité des petits producteurs à décortiquer",{"$nulls":6},"Alerte:","Nécessité d'acheter aux petits producteurs au prix fixé par l'Etat qui peut évoluer"]
[null,null,null,"peut mener à privilégier la vente aux industriels?",{"$nulls":7},"Prise en compte d'une évolution du prix dans le business model nécessaire"]
[null,null,null,"Complexité business: fournisseurs + clients à trouver; gestion stocks"]
[]
[]
[]
[null,null,"Modèle 3",{"$nulls":7},"Modèle 4"]
[null,null,"Business de service de transformation avec décortiqueuse",{"$nulls":7},"Business mixte production avec décortiqueuse et service"]
[]
[null,null,"Intrant","Aucun (producteur reste propriétaire d'arachide)",{"$nulls":6},"Intrant","Aucun (producteur reste propriétaire d'arachide)"]
[null,null,"Extrant","Service de pressage d'huile",{"$nulls":6},"Extrant","Service de pressage d'huile"]
[]
[{"$nulls":5},"Solution 1","Solution 2",{"$nulls":6},"Solution 1","Solution 2"]
[null,null,"Nb presses",null,null,1,2,null,null,null,"Nb presses",null,null,1,2]
[null,null,"Profitabilité",null,null,"1ère année","1ère année",null,null,null,"Profitabilité",null,null,"1ère année","1ère année"]
[null,null,"Intrant arachide min (kg)",null,null,"13,4 T","23,5 T",null,null,null,"Intrant arachide min (kg)",null," ","13,4 T","16,8 T"]
[null,null,"Fonctionnement presse min (heures/jour)",null,null,11,7,null,null,null,"Fonctionnement presse min (heures/jour)",null,null,8,5]
[{"$nulls":10},"Prix achat arachide décortiquée maximum",null,null,220,220]
[null,null,"Prix prestation min",null,null,200,200,null,null,null,"Prix vente huile brute minimum",null,null,1000,1000]
[null,null,"Bénéfice min cumulé sur 5 ans",null,null,1214862,2265039,null,null,null,"Prix prestation min",null,null,150,150]
[null,null,"Bénéfice min cumulé sur 9 ans",null,null,7632052.6378305135,11477664.586775661,null,null,null,"Bénéfice min cumulé sur 5 ans",null,null,683594,1297217]
[{"$nulls":10},"Bénéfice min cumulé sur 9 ans",null,null,6259903.8182514552,8804899.8788981438]
[]
[null,null,"Alerte:","Grande incertitude sur la durée de fonctionnement de la machine relatif",{"$nulls":6},"Alerte:"]
[null,null,null,"à l'imprévisibilité de l'apport en graines"]
[]
[]
[]
[]
[null,"Préconisations",null,"(1) La décortiqueuse semble clé pour permettre d'obtenir un projet rentable dans la durée, car elle permet d'augmenter la marge sur l'huile vendue"]
[null,null,null,"(2) Choisir 2 pilotes complémentaires:"]
[{"$nulls":4},"a. Un pilote avec un modèle d'exploitation plus \"simple\" de type \"service de transformation\" (modèle 3 ou 4) avec des chances de réussite plus élevées"]
[{"$nulls":4},"b. Un pilote avec un modèle d'exploitation complexe (modèle 1 ou 2) qui sera un pilote plus risqué"]
[null,null,null,"(3) Choisir comme cible des producteurs déjà impliqués dans la transformation de l'arachide en huile afin de simplifier l'approche business et augmenter les chancs de réussite du projet"]
[null,null,null,"(4) Dans le cas d'un pilote complexe avec achat de l'arachide aux producteurs, favoriser un modèle tout intégré avec système de décortication solaire, qui permettra de générer un revenu marginal plus élevé"]
[null,null,null,"(5) La performance du projet étant très dépendante de la productivité de la machine, l'entretien sera primordial pour limiter les pannes et arrêts de production: mettre en place un système d'épargne des amortissements"]
[null,null,null,"pour financer les éventuels travaux. Ce système pourra être géré par un organisme partenaire (commune ou ONG locale)."]