{"text_format":"2","workbook":"xlsx","n_sheets":10,"sheets":["LÉEME","ENTRADA_Precontrol","ENTRADA_Adjuste de Valoración","ENTRADA_Parámetros Geofísicos","ENTRADA_Condiciones de Mercado","SALIDA_Resultados","Traducción","Calculations","Lists","Lists 2"],"not_rendered":{"charts":9,"images":51,"macros":0,"external_links":4,"defined_names":232,"comments":1,"pivot_tables":0},"unopened":[],"bounds":{"document_bytes":16777216,"sheet_cells":100000,"run_cost":"one","rows_first":2000,"rows_last":500,"rows_between":2000,"halvings":0,"cell_chars":16384,"cell_head_chars":4096},"cells_cut":0,"cells_raw":0,"read":"whole","date_system":"1900"}

{"sheet":"LÉEME","index":0,"n_rows":43,"n_cols":3,"rows_kept":43,"cut":false,"hidden":false,"merged":[]}
[]
[null,null,"Hoja Léeme"]
[]
[]
[]
[]
[null,null,"MERCADO - Herramienta de Evaluación de Mercado"]
[]
[null,null,"Introducción"]
[null,null,"Esta herramienta complementa el módulo MERCADO en la Caja de herramientas de SPIS. La herramienta sirve para determinar los parámetros geofísicos resaltados como hacer o deshacer. Si cualquiera de los parámetros obtiene un puntaje de 0, se considera que el área tiene muy poco potencial para SPIS. Un 'sí' de esta evaluación permite la consideración de otros parámetros."]
[]
[null,null,"Consejos & trucos"]
{"$rows_empty":12}
[null,null,"Sinopsis"]
[null,null,"Esta herramienta incluye las siguientes hojas:"]
{"$rows_left_out":18}
{"sheet":"ENTRADA_Precontrol","index":1,"n_rows":32,"n_cols":20,"rows_kept":32,"cut":false,"hidden":false,"merged":[[13,19,16,19],[15,17,16,17],[15,18,16,18],[3,0,3,15],[7,3,7,11],[8,3,8,11],[15,0,19,0],[16,6,17,6],[16,7,17,7],[16,8,17,8],[16,9,17,9],[16,10,17,10],[1,4,1,10],[2,4,2,12],[18,14,19,14],[15,15,19,15],[9,1,9,8],[5,3,5,11],[6,3,6,11],[14,2,14,7],[14,8,14,13],[15,1,17,1],[15,14,17,14],[16,13,17,13],[16,11,17,11],[16,12,17,12],[16,5,17,5],[21,1,22,15],[12,2,12,13],[13,2,13,13],[10,0,11,0],[10,1,11,13],[16,2,17,2],[16,3,17,3],[16,4,17,4],[15,2,15,7],[15,8,15,13]]}
[]
[{"$nulls":4},"ENTRADA - Precontrol"]
[]
[]
[]
[null,"País:",null," Kenya"]
[null,"Área de interés:"]
[null,"Fecha de evaluación:"]
[null,"Nombre del evaluador/a:"]
[]
[1,"Parámetros Geofísicos",{"$nulls":12},"Puntuación máx. posible","Puntuación alcanzada"]
[{"$nulls":14},9,{"$f":"IF(COUNTIF(S14:S17,0)=0,S14+S15+S16,0)","v":9}]
[null,"Preguntas","Fuente de datos de muestra",{"$nulls":11},"Respuesta","Aptitud",null,"Parameter","Score","Raw Score"]
["a)",{"$f":"\"¿Cuál es la cobertura de terreno predominante en \"&ENTRADA_Precontrol!D6&\"?\"","v":"¿Cuál es la cobertura de terreno predominante en  Kenya?"},"Cobertura global de terreno",{"$nulls":11},"Mosaic crop land with natural vegetation",{"$f":"VLOOKUP(O14,'Lists 2'!A:B,2,0)","v":"Highly Suitable"},null,"Land Cover",{"$f":"IF(P14=\"Highly Suitable\", \"3\", IF(P14=\"Moderately Suitable\", \"2\", IF(P14=\"Marginally Suitable\", \"1\", \"0\")))","v":"3"},{"$f":"IF(COUNTIF(S14:S17,0)=0,S14+S15+S16,0)","v":9}]
["b)",{"$f":"\"¿Cuál es la irradiación solar anual promedio en \"&ENTRADA_Precontrol!D6&\"? (kWh/kW pico - valor PVOUT)\"","v":"¿Cuál es la irradiación solar anual promedio en  Kenya? (kWh/kW pico - valor PVOUT)"},"\nMapa solar del Banco Mundial",{"$nulls":5},"Atlas global de IRENA para la energía renovable",{"$nulls":5},"Above 1460",{"$f":"IF(O15=\"0 - 948\", \"Not Suitable\", IF(O15=\"949 - 1094\", \"Marginally Suitable\", IF(O15=\"1095 - 1460\", \"Moderately Suitable\", \"Highly Suitable\")))","v":"Highly Suitable"},null,"Solar Irradiation",{"$f":"IF(O15=\"Above 1460\", \"3\", IF(O15=\"1095 - 1460\", \"2\", IF(O15=\"949 - 1094\", \"1\", \"0\")))","v":"3"}]
{"$rows_left_out":18}
{"sheet":"ENTRADA_Adjuste de Valoración","index":2,"n_rows":41,"n_cols":9,"rows_kept":41,"cut":false,"hidden":false,"merged":[[11,1,11,5],[10,1,10,5],[4,5,6,5],[3,0,3,5]]}
[]
[null,null,null,"ENTRADA - Adjuste de Valoración"]
[]
[]
[]
[null,"Parámetros Geofísicos:"]
[null,"Parámetros Geofísicos no críticos"]
[null,"Parámetros adicionales que son clave para la evaluación del mercado para SPIS. Estos no afectan la viabilidad general de SPIS; afectan el éxito de la adopción de SPIS en una región según las condiciones geofísicas prevalecientes (por ejemplo, nivel freático, presencia de heladas, topografía, sistema agrícola de producción agrícola, etc.)."]
[null,"Inconsequential"]
[null,{"$f":"H40","v":9.0909090909090912E-2}]
[]
[null,"Condiciónes de Negocio:"]
[null,"1. Intervenciones del gobierno",null,"2. Intervenciones de organizaciones de desarrollo",null,"3. Financiación"]
[null,"Evaluación de las intervenciones del gobierno como un parámetro del entorno empresarial para SPIS, analizando las políticas, normas y reglamentos que gobiernan los sectores del riego y la energía solar.",null,"Esta sección evalúa las intervenciones de las organizaciones de desarrollo que pueden influir de manera significativa en la adopción de SPIS dentro de un país o región.",null,"El parámetro analiza la capacidad de los usuarios finales para cubrir el alto costo de capital de SPIS, incluyendo el apoyo financiero del gobierno, las agencias de desarrollo y el sector privado."]
[null,"Slightly important",null,"Inconsequential",null,"Inconsequential"]
{"$rows_left_out":27}
{"sheet":"ENTRADA_Parámetros Geofísicos","index":3,"n_rows":17,"n_cols":10,"rows_kept":17,"cut":false,"hidden":false,"merged":[[1,2,1,3],[7,2,7,3],[8,2,8,3],[9,2,9,3],[4,0,5,0],[6,2,6,3],[4,1,5,3],[3,0,3,5],[13,2,13,3],[14,2,14,3],[15,2,15,3],[16,2,16,3],[11,1,11,5]]}
[]
[null,null,"ENTRADA - Parámetros Geofísicos"]
[]
[]
[2,"Parámetros Geofísicos Adicionales",null,null,"Puntuación más alta posible","Puntuación alcanzada"]
[{"$nulls":4},{"$f":"'ENTRADA_Adjuste de Valoración'!B10","v":9.0909090909090912E-2},{"$f":"SUM(I8:I11)","v":7.2727272727272738E-2}]
[null,"Preguntas","Fuente de datos de muestra",null,"Repuesta","Relevancia",null,"Weight","Attained Score","Raw Score"]
["a)",{"$f":"\"¿Cuál es el nivel freático promedio en\"&ENTRADA_Precontrol!D6&\" asignado por SPIS?\"","v":"¿Cuál es el nivel freático promedio en Kenya asignado por SPIS?"},"Profundidad estimada de los recursos de aguas subterráneas",null,"25m - 50m","Inconsequential",null,{"$f":"E6/COUNTA(B8,B9,B10,B11)","v":2.2727272727272728E-2},{"$f":"(J8*H8)","v":1.3636363636363636E-2},{"$f":"IF(E8=\"Up to 7m\",1,IF(E8=\"7m - 25m\",0.8,IF(E8=\"25m - 50m\",0.6,IF(E8=\"50m - 100m\",0.1,IF(E8=\"Beyond 100m\",0,IF(E8=\"Unknown\",0))))))*IF(F8=\"Inconsequential\",6,IF(F8=\"Slightly important\",5,IF(F8=\"Important\",4,IF(F8=\"Very important\",3,IF(F8=\"Critical\",2)))))/6","v":0.6}]
["b)",{"$f":"\"¿Cuál es la temperatura ambiente anual mínima de\"&ENTRADA_Precontrol!D6&\" en relación con la frecuencia de heladas?\"","v":"¿Cuál es la temperatura ambiente anual mínima de Kenya en relación con la frecuencia de heladas?"},"Datos de temperatura global del Banco Mundial",null,"1C to 30C","Inconsequential",null,{"$f":"(E6/COUNTA(B8,B9,B10,B11))","v":2.2727272727272728E-2},{"$f":"(J9*H9)","v":2.2727272727272728E-2},{"$f":"IF(E9=\"1C to 30C\",(IF(F9=\"Inconsequential\",6,IF(F9=\"Slightly important\",5,IF(F9=\"Important\",4,IF(F9=\"Very important\",3,IF(F9=\"Critical\",2)))))),(IF(F9=\"Inconsequential\",6,IF(F9=\"Slightly important\",4,IF(F9=\"Important\",2,IF(F9=\"Very important\",1,IF(F9=\"Critical\",0)))))))/6","v":1}]
["c)",{"$f":"\"¿Cómo se considera la topografía general de\"&ENTRADA_Precontrol!D6&\"?\"","v":"¿Cómo se considera la topografía general de Kenya?"},"¿Cuál es la pendiente del área?",null,"Moderate","Inconsequential",null,{"$f":"(E6/COUNTA(B8,B9,B10,B11))","v":2.2727272727272728E-2},{"$f":"(J10*H10)","v":1.8181818181818184E-2},{"$f":"IF(E10=\"Flat\",1,IF(E10=\"Moderate\",0.8,IF(E10=\"Steep\",0.6)))*IF(F10=\"Inconsequential\",6,IF(F10=\"Slightly important\",5,IF(F10=\"Important\",4,IF(F10=\"Very important\",3,IF(F10=\"Critical\",2)))))/6","v":0.80000000000000016}]
["d)",{"$f":"\"¿Cuál es el principal tipo de producción en el sistema agrícola de\"&ENTRADA_Precontrol!D6&\"?\"","v":"¿Cuál es el principal tipo de producción en el sistema agrícola de Kenya?"},"Zonas agroecológicas globales","Mapas de Sistemas de Agricultura FAO","Perennial Crops","Inconsequential",null,{"$f":"(E6/COUNTA(B8,B9,B10,B11))","v":2.2727272727272728E-2},{"$f":"(J11*H11)","v":1.8181818181818184E-2},{"$f":"IF(E11=\"Seasonal Crops\",0.6,IF(E11=\"Perennial Crops\",0.8,IF(E11=\"Small Livestock\",0.95,IF(E11=\"Large Livestock\",0.9,IF(E11=\"Seasonal and Perennial Crops\",0.7,IF(E11=\"Livestock and crops\",0.7))))))*IF(F11=\"Inconsequential\",6,IF(F11=\"Slightly important\",5,IF(F11=\"Important\",4,IF(F11=\"Very important\",3,IF(F11=\"Critical\",2)))))/6","v":0.80000000000000016}]
[null,{"$f":"IF((Calculations!G4)<(50 %), \"¡Su puntuación está por debajo del 50% de sus valores iniciales para los parámetros geofísicos! Por favor revise su configuración de valoración!\", \"\")","v":""}]
[]
[null,null,"¿Conoce fuentes de datos más recientes?"]
[null,null,"POR FAVOR COMPARTA"]
{"$rows_left_out":3}
{"sheet":"ENTRADA_Condiciones de Mercado","index":4,"n_rows":108,"n_cols":10,"rows_kept":108,"cut":false,"hidden":false,"merged":[[83,9,85,9],[39,7,43,7],[39,8,43,8],[39,9,43,9],[7,7,9,7],[7,8,9,8],[7,9,9,9],[1,2,1,3],[13,0,14,0],[13,1,14,3],[14,7,14,9],[4,0,5,0],[4,1,5,3],[5,7,5,9],[6,2,6,3],[10,2,10,3],[7,1,9,1],[7,5,9,5],[7,0,9,0],[7,2,9,2],[7,4,9,4],[3,0,3,5],[104,2,104,3],[105,2,105,3],[106,2,106,3],[107,2,107,3],[15,2,15,3],[17,1,18,1],[17,4,19,4],[66,1,66,5],[62,1,62,5],[63,2,63,3],[64,2,64,3],[65,2,65,3],[61,2,61,3],[59,1,60,3],[57,2,57,3],[99,2,101,3],[81,2,81,3],[82,2,82,3],[84,5,85,5],[84,4,85,4],[86,4,87,4],[21,1,22,3],[17,5,19,5],[28,3,29,3],[97,2,97,3],[59,0,60,0],[17,8,19,8],[17,9,19,9],[19,2,19,3],[21,0,22,0],[17,7,19,7],[17,0,18,0],[52,0,53,0],[34,0,35,0],[23,2,23,3],[39,0,43,0],[39,5,43,5],[38,2,38,3],[39,1,43,1],[43,2,43,3],[39,3,40,3],[39,4,43,4],[28,2,29,2],[86,7,87,7],[86,8,87,8],[86,9,87,9],[83,7,85,7],[83,8,85,8],[98,1,98,5],[84,1,85,1],[84,0,85,0],[84,3,87,3],[85,2,86,2],[86,1,87,1],[86,0,87,0],[79,0,80,0],[70,0,71,0],[70,1,71,3],[72,2,72,3],[73,2,73,3],[74,2,74,3],[75,2,75,3],[76,2,76,3],[77,2,77,3],[79,1,80,3],[86,5,87,5],[89,1,90,3],[91,2,91,3],[83,3,83,5],[89,0,90,0],[92,1,92,5],[93,2,96,3],[102,1,102,5],[88,1,88,5],[69,1,69,5],[58,1,58,5],[51,1,51,5],[33,1,33,5],[20,1,20,5],[12,1,12,5],[78,1,78,5],[45,1,45,5],[24,1,24,5],[25,2,25,3],[26,2,26,3],[27,1,27,5],[30,1,30,5],[31,2,31,3],[32,2,32,3],[56,2,56,3],[55,2,55,3],[54,2,54,3],[52,1,53,3],[48,1,48,5],[37,1,37,5],[34,1,35,3]]}
[]
[null,null,"ENTRADA - Condiciones de Mercado"]
[]
[]
[1,"Intervenciones Gubernamentales",null,null,"Puntuación máx. posible","Puntuación alcanzada"]
[{"$nulls":4},{"$f":"'ENTRADA_Adjuste de Valoración'!B16","v":0.18181818181818182},{"$f":" IF(OR(AND(E8=\"No\",F8=\"Critical\"),AND(E11=\"No\",F11=\"Critical\"),AND(E12=\"No\",F12=\"Critical\")),0,SUM(I8:I12))","v":7.0707070707070704E-2}]
[null,"Preguntas","Fuentes de datos de muestra",null,"Respuesta","Relevancia",null,"Weight","Attained score","Raw Score"]
["a)",{"$f":" \"¿El gobierno de\" &ENTRADA_Precontrol!D6&\", las políticas y leyes nacionales y locales fomentan el uso de equipos de riego solar?\"","v":"¿El gobierno de Kenya, las políticas y leyes nacionales y locales fomentan el uso de equipos de riego solar?"},"• Políticas de riego y / o energía solar, leyes, planes de desarrollo del sector\n• Licencias de técnicos en energía solar, proveedores y / o empresas contratistas\n• Regulación fiscal del gobierno como exenciones de impuestos y aranceles","Políticas de desarrollo de energía limpia","No","Important",null,{"$f":"E6/COUNTA(B8:B12)","v":6.0606060606060608E-2},{"$f":"(J8*H8)","v":1.01010101010101E-2},{"$f":"(IF(E8=\"Yes\",(IF(F8=\"Inconsequential\",3,IF(F8=\"Slightly important\",4,IF(F8=\"Important\",4,IF(F8=\"Very important\",5,IF(F8=\"Critical\",6)))))),(IF(F8=\"Inconsequential\",3,IF(F8=\"Slightly important\",2,IF(F8=\"Important\",1,IF(F8=\"Very important\",1,IF(F8=\"Critical\",0))))))))/6","v":0.16666666666666666}]
[null,null,null,"Políticas de apoyo a las energías renovables en los países en desarrollo: tabla 4, pág. 121"]
[null,null,null,"Documentos de política de países de Asia-Pacífico"]
["b)",{"$f":"\"¿Hay programas gubernamentales en\"&ENTRADA_Precontrol!D6&\" que fomenten el uso de dispositivos SPIS?\"","v":"¿Hay programas gubernamentales en Kenya que fomenten el uso de dispositivos SPIS?"},"• Programas de riego y energía solar apoyados por recursos del gobierno",null,"Unknown","Inconsequential",null,{"$f":"E6/COUNTA(B8:B12)","v":6.0606060606060608E-2},{"$f":"(J11*H11)","v":3.0303030303030304E-2},{"$f":"(IF(E11=\"Yes\",(IF(F11=\"Inconsequential\",3,IF(F11=\"Slightly important\",4,IF(F11=\"Important\",4,IF(F11=\"Very important\",5,IF(F11=\"Critical\",6)))))),(IF(F11=\"Inconsequential\",3,IF(F11=\"Slightly important\",2,IF(F11=\"Important\",1,IF(F11=\"Very important\",1,IF(F11=\"Critical\",0))))))))/6","v":0.5}]
["c)",{"$f":"\"¿Existen ministerios y instituciones relevantes del gobierno de\"&ENTRADA_Precontrol!D6&\" que brinden apoyo al sector?\"","v":"¿Existen ministerios y instituciones relevantes del gobierno de Kenya que brinden apoyo al sector?"},"• Ministerios de agricultura y energía con participación en el sector SPIS\n• Organizaciones gubernamentales de riego, juntas, grupos\n• Organizaciones gubernamentales que brindan información relacionada con SPIS\n• Regulación y cumplimiento de normas gubernamentales de calidad y estándares","Regulaciones e incentivos de sistemas aislados","Unknown","Inconsequential",null,{"$f":"E6/COUNTA(B8:B12)","v":6.0606060606060608E-2},{"$f":"(J12*H12)","v":3.0303030303030304E-2},{"$f":"(IF(E12=\"Yes\",(IF(F12=\"Inconsequential\",3,IF(F12=\"Slightly important\",4,IF(F12=\"Important\",4,IF(F12=\"Very important\",5,IF(F12=\"Critical\",6)))))),(IF(F12=\"Inconsequential\",3,IF(F12=\"Slightly important\",2,IF(F12=\"Important\",1,IF(F12=\"Very important\",1,IF(F12=\"Critical\",0))))))))/6","v":0.5}]
[]
[2,"Intervenciones de Organizaciones de Desarrollo",null,null,"Puntuación máx. posible","Puntuación alcanzada"]
[{"$nulls":4},{"$f":"'ENTRADA_Adjuste de Valoración'!D16","v":9.0909090909090912E-2},{"$f":" IF(OR(AND(E17=\"No\",F17=\"Critical\"),AND(E18=\"No\",F18=\"Critical\")),0,SUM(I17:I20))","v":9.0909090909090912E-2}]
{"$rows_left_out":94}
{"sheet":"SALIDA_Resultados","index":5,"n_rows":32,"n_cols":9,"rows_kept":32,"cut":false,"hidden":false,"merged":[[1,3,1,8],[18,1,18,11],[3,2,3,3],[4,2,4,3],[3,6,3,7],[3,8,3,9],[4,6,4,7],[4,8,4,10],[5,1,5,4],[5,7,5,11]]}
[]
[null,null,null,"SALIDA - Resultados"]
[]
[null,"País:",{"$f":"ENTRADA_Precontrol!D6","v":" Kenya"},null,null,null,"Fecha de evaluación:","Fecha de evaluación:",{"$f":"ENTRADA_Precontrol!D8","v":"00:00:00"}]
[null,"Área de interés:",{"$f":"ENTRADA_Precontrol!D7","v":0},null,null,null,"Nombre del evaluador/a:","Nombre del evaluador:",{"$f":"ENTRADA_Precontrol!D9","v":0}]
[null,"Puntuación total (%)",{"$nulls":5},"Resumen de las Calificaciones de Relevancia"]
{"$rows_empty":12}
[null,"B. Potencial de Mercado para SPIS: Puntuación General"]
{"$rows_empty":9}
[null,"Potencial de Mercado Bajo"]
[null,"Potencial de Mercado Insignificante"]
[null,"Potencial de Mercado Moderado"]
[null,"Potencial de Mercado Alto"]

{"sheet":"Traducción","index":6,"n_rows":87,"n_cols":10,"rows_kept":87,"cut":false,"hidden":false,"merged":[]}
[null,"English",null,null,null,"Français",null,null,null,"Español"]
[]
[{"$nulls":9},"Hoja: ENTRADA_Pre-Verificación"]
[null,"Cropland, rainfed",{"$nulls":7},"Tierras de cultivo, secano"]
[null,"Cropland irrigated or post-flooding",{"$nulls":7},"Tierras de cultivo irrigadas o posteriores a las inundaciones"]
[null,"Mosaic crop land with natural vegetation",{"$nulls":7},"Tierra de cultivos de mosaico con vegetación natural"]
[null,"Light forest (tree cover up to 40%)",{"$nulls":7},"Bosque claro (cobertura de árboles hasta 40%)"]
[null,"Dense forest (tree cover above 40%)",{"$nulls":7},"Bosque denso (cobertura arbórea superior al 40%)"]
[null,"Shrubland",{"$nulls":7},"Matorral"]
[null,"Grassland",{"$nulls":7},"Pradera"]
[null,"Lichens and mosses",{"$nulls":7},"Líquenes y musgos"]
[null,"Semi arid sparse vegetation",{"$nulls":7},"Vegetación escasa semi árida"]
[null,"Flood plains fresh water",{"$nulls":7},"Inundaciones, llanuras, agua dulce"]
[null,"Flood plains brackish water",{"$nulls":7},"Inundaciones, llanuras, agua salobre"]
[null,"Urban areas",{"$nulls":7},"Áreas urbanas"]
{"$rows_left_out":66}
{"sheet":"Calculations","index":7,"n_rows":36,"n_cols":7,"rows_kept":36,"cut":false,"hidden":true,"merged":[]}
[]
[]
[null,"Enabling SPIS Business Factors","Initial weight setting","Actually attained score ","Difference ",null,"Attained Score"]
[1,"Geophysical Parameters",{"$f":"'ENTRADA_Parámetros Geofísicos'!E6","v":9.0909090909090912E-2},{"$f":"'ENTRADA_Parámetros Geofísicos'!F6","v":7.2727272727272738E-2},{"$f":"C4-D4","v":1.8181818181818174E-2},{"$f":"100%-C4","v":0.90909090909090906},{"$f":"D4/C4","v":0.8}]
[2,"Government interventions",{"$f":"'ENTRADA_Condiciones de Mercado'!E6","v":0.18181818181818182},{"$f":"'ENTRADA_Condiciones de Mercado'!F6","v":7.0707070707070704E-2},{"$f":"C5-D5","v":0.11111111111111112},{"$f":"100%-C5","v":0.81818181818181812},{"$f":"D5/C5","v":0.38888888888888884}]
[3,"Development Organizations Interventions",{"$f":"'ENTRADA_Condiciones de Mercado'!E15","v":9.0909090909090912E-2},{"$f":"'ENTRADA_Condiciones de Mercado'!F15","v":9.0909090909090912E-2},{"$f":"C6-D6","v":0},{"$f":"100%-C6","v":0.90909090909090906},1]
[4,"Financing",{"$f":"'ENTRADA_Condiciones de Mercado'!E23","v":9.0909090909090912E-2},{"$f":"'ENTRADA_Condiciones de Mercado'!F23","v":4.5454545454545456E-2},4.5454545454545456E-2,0.90909090909090906,0.5]
[5,"Availability  and cost of alternative sources of power for pumping",{"$f":"'ENTRADA_Condiciones de Mercado'!E36","v":9.0909090909090912E-2},{"$f":"'ENTRADA_Condiciones de Mercado'!F36","v":5.6818181818181823E-2},3.4090909090909088E-2,0.90909090909090906,0.625]
[6,"Technical capacity for SPIS",{"$f":"'ENTRADA_Condiciones de Mercado'!E54","v":9.0909090909090912E-2},{"$f":"'ENTRADA_Condiciones de Mercado'!F54","v":4.5454545454545456E-2},4.5454545454545456E-2,0.90909090909090906,0.5]
[7,"Awareness of solar PV and irrigation technologies ",{"$f":"'ENTRADA_Condiciones de Mercado'!E61","v":9.0909090909090912E-2},{"$f":"'ENTRADA_Condiciones de Mercado'!F61","v":4.5454545454545456E-2},4.5454545454545456E-2,0.90909090909090906,0.5]
[8,"Significance of agriculture in the local economy",{"$f":"'ENTRADA_Condiciones de Mercado'!E72","v":9.0909090909090912E-2},{"$f":"'ENTRADA_Condiciones de Mercado'!F72","v":4.5454545454545456E-2},4.5454545454545456E-2,0.90909090909090906,0.5]
[9,"Land use rights, ownership and tenure ",{"$f":"'ENTRADA_Condiciones de Mercado'!E81","v":9.0909090909090912E-2},{"$f":"'ENTRADA_Condiciones de Mercado'!F81","v":4.5454545454545456E-2},4.5454545454545456E-2,0.90909090909090906,0.5]
[10,"Transportation and communication infrastructure ",{"$f":"'ENTRADA_Condiciones de Mercado'!E91","v":9.0909090909090912E-2},{"$f":"'ENTRADA_Condiciones de Mercado'!F91","v":4.5454545454545456E-2},4.5454545454545456E-2,0.90909090909090906,0.5]
[null,null,{"$f":"SUM(C4:C13)","v":1.0000000000000002},{"$f":"SUM(D4:D13)","v":0.56388888888888888},{"$f":"C14-D14","v":0.43611111111111134}]
[]
{"$rows_left_out":22}
{"sheet":"Lists","index":8,"n_rows":241,"n_cols":7,"rows_kept":241,"cut":false,"hidden":true,"merged":[]}
["Countries","Development Agencies","Facilitites and Funds","Other NGOs, Foundations","Rural MPI","GNI per Capita","pump manufacturers"]
["Afghanistan","African Development Bank","CTF (Clean Technology Fund)","AAA (Adaptation of African Agriculture)","0.10 - 1.86","Low income ($1,005 or less)","AllightSykes"]
[" Albania","CGIAR (Climate Change, Agriculture and Food Security)","EcoMicro","AGRA","1.87 - 8.80","Lower Middle Income ($1,006 to $3,955)","Ebara"]
[" Algeria","DFID ( Department for International Development - United Kingdom)","GEF (Global Environment Facility)","Energy 4Impact","8.81 - 26.06","Upper Middle Income ($3,956 tp $12,235)","Flowserve"]
[" American Samoa","FAO (Food and Agriculture Organization) ","GPOBA (Global Partnershi on Output Based Aid)","IFPRI (International Food Policy Research Institute)","26.07 - 48.54","High Income ($12.236 or more)","Grundfos"]
[" Andorra","GACSA (Global Alliance For Climate-Smart Agriculture)","ICBA","Lutheran World Relief","48.55 - 68.29",null,"Kirloskar Brothers Lt"]
[" Angola","GIZ (Deutsche Gesellschaft für Internationale Zusammenarbeit GmbH)","ICBA (International Center for Biosaline Agriculture)","The Practica Foundation","68.30 - 84.33",null,"KSB"]
[" Anguilla","IFAD (International Fund for Agriculture Development)",null,null,"84.34 - 96.90",null,"Lorentz"]
[" Antarctica","JICA (Japan International Cooperation Agency)",null,null,"No data",null,"Ruhrpumpen Group"]
[" Antigua and Barbuda","Nordic Development Fund",{"$nulls":4},"Suzler Ltd"]
[" Argentina","OECD (Organisation for Economic Co-operation and Development)",{"$nulls":4},"Weir Group"]
[" Armenia","OFID (OPEC Fund for International Development)",{"$nulls":4},"Wilo SE"]
[" Aruba","SIDA (Swedish International Development Cooperation Agency)",{"$nulls":4},"Xylem"]
[" Australia","USAID"]
[" Austria","World Bank Group"]
{"$rows_left_out":227}
{"sheet":"Lists 2","index":9,"n_rows":241,"n_cols":16,"rows_kept":241,"cut":false,"hidden":true,"merged":[]}
["Column1","Column2","Column3","Column4","Column1",null,null,"Solar Ranges",null,"Groundwater Depth",null,"Topography",null,"Ambient temperature",null,"Population Density"]
["Cropland, rainfed","Highly Suitable",null,null," Afghanistan",null,null,"0 - 948",null,"Up to 7m",null,"Mountainous",null,"Below 1C",null,"<1"]
["Cropland irrigated or post-flooding","Highly Suitable",null,null," Albania",null,null,"949 - 1094",null,"7m - 25m",null,"Steep hills",null,"1C to 30C",null,"1 - 5"]
["Mosaic crop land with natural vegetation","Highly Suitable",null,null," Algeria",null,null,"1095 - 1460",null,"25m - 50m",null,"Rolling hills",null,null,null,"5 - 25"]
["Light forest (tree cover up to 40%)","Moderately Suitable",null,null," American Samoa",null,null,"Above 1460",null,"50m - 100m",null,"Level",null,null,null,"25 - 250"]
["Dense forest (tree cover above 40%)","Moderately Suitable",null,null," Andorra",{"$nulls":4},"Beyond 100m",null,"Mixed various",null,null,null,"250 - 1000"]
["Shrubland","Marginally Suitable",null,null," Angola",{"$nulls":4},"Unknown",{"$nulls":5},">1000"]
["Grassland","Moderately Suitable",null,null," Anguilla"]
["Lichens and mosses","Marginally Suitable",null,null," Antarctica"]
["Semi arid sparse vegetation","Marginally Suitable",null,null," Antigua and Barbuda"]
["Flood plains fresh water","Marginally Suitable",null,null," Argentina"]
["Flood plains brackish water","Not Suitable",null,null," Armenia"]
["Urban areas","Not Suitable",null,null," Aruba"]
["Bare areas","Marginally Suitable",null,null," Australia"]
["Water bodies","Not Suitable",null,null," Austria"]
{"$rows_left_out":226}