{"text_format":"2","workbook":"xlsx","n_sheets":13,"sheets":["LISEZ-MOI","List of dropdown","1 Informations générales","2 Équipements et actifs","3 Recettes cultures & élévage","4 Autres recettes","5 Financement","6 Coûts Fixes et Variables","Graph table","7 Compte de résultat","Calcul des prix des cultures","Contrôle rapide","Feuille de traduction"],"not_rendered":{"charts":1,"images":13,"macros":0,"external_links":0,"defined_names":130,"comments":1,"pivot_tables":0},"unopened":[],"bounds":{"document_bytes":16777216,"sheet_cells":100000,"run_cost":"one","rows_first":2000,"rows_last":500,"rows_between":2000,"halvings":0,"cell_chars":16384,"cell_head_chars":4096},"cells_cut":0,"cells_raw":0,"read":"whole","date_system":"1900"}

{"sheet":"LISEZ-MOI","index":0,"n_rows":109,"n_cols":7,"rows_kept":109,"cut":false,"hidden":false,"merged":[[10,3,10,9],[15,3,15,9],[17,3,17,9],[25,3,25,9],[35,3,35,9],[37,3,38,5],[37,6,38,9],[49,3,50,5],[49,6,50,9],[39,3,40,5],[39,6,40,9],[61,3,61,9],[41,3,43,5],[51,6,52,9],[51,3,52,5],[47,3,48,5],[47,6,48,9],[53,6,54,9],[53,3,54,5],[55,6,57,9],[55,3,57,5],[59,0,59,9],[62,5,62,6],[63,3,64,4],[63,5,64,9],[65,3,65,4],[65,5,65,7],[72,3,83,9],[85,3,98,9],[100,3,106,9],[108,3,108,5],[18,3,23,9],[44,6,46,9],[44,3,46,5],[41,6,43,9],[66,3,66,4],[66,5,66,9],[67,3,69,4],[67,5,68,9],[69,5,69,7],[70,3,70,4],[70,5,70,7],[62,3,62,4]]}
{"$rows_empty":10}
[null,null,null,"Lisez-moi"]
[]
[]
[]
[]
[null,null,null,"INVESTIR – Outil d’analyse de l’exploitation agricole"]
[]
[null,null,null,"Introduction"]
[null,null,null,"Cet outil permet d’évaluer la productivité et la rentabilité d’une exploitation en se fondant sur sa production agricole annuelle moyenne. Il permet d’établir des valeurs de référence ou d’évaluer l’impact d’investissements prévus. L’outil permet à un conseiller en SPIS (fournisseur, professionnel du développement, agent de vulgarisation) d’aider une exploitation agricole à identifier les coûts inutiles, à déterminer les activités qui apportent le plus de valeur et à bien rentabiliser les différents intrants. "]
[]
[]
[]
[]
[]
[]
[null,null,null,"Conseils et astuces"]
{"$rows_empty":9}
[null,null,null,"Aperçu"]
[null,null,null,"Cet outil est composé des feuilles suivantes :"]
{"$rows_left_out":43}
{"sheet":"List of dropdown","index":1,"n_rows":19,"n_cols":2,"rows_kept":19,"cut":false,"hidden":true,"merged":[]}
[]
["Superficie","CF à ha"]
["ha",1]
["Acre",2.47105]
["Sq. km",0.01]
["Sq. m",10000]
["Sq. yard",11959.9]
["Sq. ft",107639]
[]
["Facteur de conversion",{"$f":"VLOOKUP('1 Informations générales'!D14,'List of dropdown'!A3:B8,2,FALSE)","v":1}]
[]
[]
["Poids ","CF to kg"]
["kg",1]
["metric ton",1000]
["quintal",100]
["pound (lb)",0.4536]
[]
["Facteur de conversion",{"$f":"VLOOKUP('1 Informations générales'!D15,'List of dropdown'!A14:B17,2,FALSE)","v":1}]

{"sheet":"1 Informations générales","index":2,"n_rows":37,"n_cols":10,"rows_kept":37,"cut":false,"hidden":false,"merged":[[0,0,0,9],[5,7,5,9],[10,2,10,7],[16,1,16,9],[17,1,17,9],[1,1,2,9],[7,2,7,4],[9,2,9,4],[8,2,8,4],[4,2,4,4],[5,2,5,4],[4,7,4,9]]}
["INVESTIR – Outil d’analyse de l’exploitation agricole"]
[null,"1 RENSEIGNEMENTS GÉNÉRAUX SUR L'EXPLOITATION"]
[]
[]
[null,"Pays",{"$nulls":4},"Région"]
[null,"Code ou nom de l’exploitation",{"$nulls":4},"Date"]
[{"$nulls":6},"  "]
[null,"Village"]
[null,"Division"]
[null,"District"]
[null,"Enquêteur"]
[null,"Campagne agricole (années)",null,2018,2019,"(Année à quatre chiffres chacune ! )"]
[null,"Monnaie utilisée pour les calculs",null,"€"]
[null,"Unité de mesure de surface",null,"ha",{"$nulls":4},"Facteur de conversion en 1 hectare :",{"$f":"'List of dropdown'!B10","v":1}]
[null,"Unité de mesure du poids",null,"kg",{"$nulls":4},"Facteur de conversion en 1 kilo :",{"$f":"'List of dropdown'!B19","v":1}]
[]
[]
[null,"RESSOURCES FONCIÈRES"]
[]
[null,"Statut de propriété",null,"Area"]
{"$rows_left_out":18}
{"sheet":"2 Équipements et actifs","index":3,"n_rows":38,"n_cols":9,"rows_kept":38,"cut":false,"hidden":false,"merged":[[37,2,37,4],[5,6,8,6],[5,3,8,3],[5,2,8,2],[0,0,0,7],[1,1,1,6],[3,5,3,6],[5,1,9,1],[5,4,8,4],[5,5,8,5]]}
["INVESTIR – Outil d’analyse de l’exploitation agricole"]
[null,"2 ÉQUIPEMENTS ET RESSOURCES"]
[]
[{"$nulls":4},"Code de l’exploitation",{"$f":"'1 Informations générales'!C6","v":0}]
[]
[null,"Type\n\n","Coût de l'équipement existant (au moment de l'achat initial)","Valeur de récupération (lors de la vente d'équipement existant)","Âge","Durée de vie normale","Dépréciation annuelle en vue du remplacement"]
[]
[]
[]
[null,null,{"$f":"'1 Informations générales'!D13","v":"€"},{"$f":"'1 Informations générales'!D13","v":"€"},"years","years",{"$f":"'1 Informations générales'!D13","v":"€"}]
[null,"Hangar pour animaux",60000,10000,2,20,{"$f":"IFERROR(SLN(C11,D11,(F11-E11)),\"\")","v":2777.7777777777778},"Durée de vie normale indicative :"]
[null,"Veuillez sélectionner",{"$nulls":4},{"$f":"IFERROR(SLN(C12,D12,(F12-E12)),\"\")","v":""},"(très dépendante de la qualité!)","Veuillez sélectionner"]
[null,"Veuillez sélectionner",{"$nulls":4},"","Hangar pour animaux  - 20 years","Hangar pour animaux"]
[null,"Veuillez sélectionner",{"$nulls":4},"","Garage/atelier – 20 ans","garage/atelier"]
[null,"Veuillez sélectionner",{"$nulls":4},"","Stockage/entrepôt – 20 ans","Stockage/entrepôt "]
[null,"Veuillez sélectionner",{"$nulls":4},"","Serre - 10 years","Serre "]
[null,"Veuillez sélectionner",{"$nulls":4},{"$f":"IFERROR(SLN(C17,D17,(F17-E17)),\"\")","v":""},"Autre bâtiment – 20 ans","Autre bâtiment"]
[null,"Veuillez sélectionner",{"$nulls":4},"","Char à bœufs – 7 ans","Char à bœufs"]
[null,"Veuillez sélectionner",{"$nulls":4},"","Camion/voiture – 10 ans","Camion/voiture"]
[null,"Veuillez sélectionner",{"$nulls":4},"","Tracteur – 10 ans","Tracteur"]
{"$rows_left_out":19}
{"sheet":"3 Recettes cultures & élévage","index":4,"n_rows":63,"n_cols":15,"rows_kept":63,"cut":false,"hidden":false,"merged":[[30,10,30,14],[32,10,32,12],[33,10,33,12],[34,10,34,12],[35,10,35,12],[62,1,62,5],[0,0,0,6],[35,1,35,6],[40,1,40,2],[40,3,40,6],[38,3,38,4],[1,1,1,6],[3,5,3,6],[7,1,7,6],[19,1,19,6],[23,1,23,6],[18,1,18,5],[34,1,34,5],[56,10,56,12],[54,10,54,14],[57,10,57,12],[58,10,58,12],[61,10,61,12],[59,10,60,14]]}
["INVESTIR – Outil d’analyse de l’exploitation agricole"]
[null,"REVENU : CULTURE SAISONNIÈRE"]
[]
[{"$nulls":4},"Code de l’exploitation",{"$f":"'1 Informations générales'!C6","v":0}]
[]
[null,"Terres agricoles utilisées :",{"$f":"SUM(C10:C14)","v":0},{"$f":"'1 Informations générales'!D14","v":"ha"}]
[null,null,null,"Unité",{"$f":"\"Rendement par \"& '1 Informations générales'!D14 &\" ou Quantité\"","v":"Rendement par ha ou Quantité"},"Prix unitaire","Valeur"]
[null,"Ventes"]
[null,"Types de cultures:","Zone:"]
[{"$nulls":6},{"$f":"+F10*E10*C10","v":0}]
[{"$nulls":6},{"$f":"+F11*E11*C11","v":0}]
[{"$nulls":6},0]
[{"$nulls":6},0]
[{"$nulls":6},0]
[null,"Produits dérivés:"]
[{"$nulls":6},{"$f":"+F16*E16","v":0}]
[{"$nulls":6},0]
[{"$nulls":6},0]
[null,"REVENU BRUT",{"$nulls":4},{"$f":"SUM(G10:G18)","v":0}]
[null,"REVENU : CULTURE PÉNÉNINIALE"]
{"$rows_left_out":44}
{"sheet":"4 Autres recettes","index":5,"n_rows":15,"n_cols":15,"rows_kept":15,"cut":false,"hidden":false,"merged":[[0,0,0,14],[1,1,1,14],[3,12,3,13],[3,10,3,11]]}
["INVESTIR – Outil d’analyse de l’exploitation agricole"]
[null,"4 AUTRES RECETTES"]
[]
[{"$nulls":10}," Code de l’exploitation",null,{"$f":"'1 Informations générales'!C6","v":0}]
[]
[null,"Mois","Janvier","Février","Mars","Avril","Mai","Juin","Juillet","Août","Septembre","Octobre","Novembre","Décembre","Total"]
[null,"Type AUTRES RECETTES",1,2,3,4,5,6,7,8,9,10,11,12]
[null,"Vente d’eau",{"$nulls":12},{"$f":"+SUM(C8:N8)","v":0}]
[null,"Équipements donnés en location",{"$nulls":12},{"$f":"+SUM(C9:N9)","v":0}]
[null,"Espace de stockage donné en location",{"$nulls":12},{"$f":"+SUM(C10:N10)","v":0}]
[null,"Terres données en location",{"$nulls":12},0]
[null,"Main-d’œuvre donnée en location",{"$nulls":12},{"$f":"+SUM(C12:N12)","v":0}]
[{"$nulls":14},{"$f":"+SUM(C13:N13)","v":0}]
[{"$nulls":14},{"$f":"+SUM(C14:N14)","v":0}]
[null,"TOTAL DES AUTRES RECETTES par mois",{"$f":"+SUM(C8:C14)","v":0},0,0,0,0,0,0,0,0,0,0,0,{"$f":"+SUM(O8:O14)","v":0}]

{"sheet":"5 Financement","index":6,"n_rows":17,"n_cols":11,"rows_kept":17,"cut":false,"hidden":false,"merged":[[0,0,0,13],[1,0,1,13],[4,8,7,8],[5,0,7,0],[5,1,7,1],[5,2,7,2],[5,3,7,3],[5,4,7,4],[5,5,7,5],[5,6,7,6],[5,9,15,13],[3,10,3,12],[4,0,4,6]]}
["INVESTIR – Outil d’analyse de l’exploitation agricole"]
["CRÉDIT ET FINANCEMENT (calculateur simplifié, à confirmer auprès du prêteur)"]
[]
[{"$nulls":9},"Code de l’exploitation",{"$f":"'1 Informations générales'!C6","v":0}]
["Calculateur",{"$nulls":7},"Saisissez manuellement :"]
["Nom de la banque","Montant du prêt","Période de crédit (années)","Mois de la prise de crédit","Année de prise de crédit","Taux d'intérêt annuel","Remboursement mensuel du prêt",null,null,"Remarque : la valeur de la calculatrice aura priorité sur la valeur manuelle. Assurez-vous que la valeur de la calculatrice est 0 afin d'utiliser la valeur manuelle."]
[{"$nulls":7},"OR"]
[]
[null,7000,3,1,2018,0.08,{"$f":"IF(D9,-PMT(F9/12,C9*12,B9),\"0\")","v":219.35455823001593}]
[{"$nulls":6},{"$f":"IF(D10,-PMT(F10/12,C10*12,B10),\"0\")","v":"0"}]
[{"$nulls":6},{"$f":"IF(D11,-PMT(F11/12,C11*12,B11),\"0\")","v":"0"}]
[{"$nulls":6},"0"]
[{"$nulls":6},"0"]
[{"$nulls":6},"0"]
[{"$nulls":6},"0"]
["TOTAL DU CRÉDIT",{"$f":"SUM(B9:B15)","v":7000},{"$nulls":4},{"$f":"SUM(G9:G15)","v":219.35455823001593},null,{"$f":"SUM(I9:I14)","v":0}]
[null,null,null,"Total des remboursements annuels des prêts",null,null,{"$f":"G16*12","v":2632.2546987601909},null,{"$f":"I16*12","v":0}]

{"sheet":"6 Coûts Fixes et Variables","index":7,"n_rows":39,"n_cols":15,"rows_kept":39,"cut":false,"hidden":false,"merged":[[5,1,6,1],[20,1,20,14],[0,0,0,14],[3,12,3,13],[1,1,1,14],[2,1,4,3]]}
["INVESTIR – Outil d’analyse de l’exploitation agricole"]
[null,"6 COÛTS (FIXES et VARIABLES)"]
[]
[{"$nulls":11},"Code de l’exploitation",{"$f":"'1 Informations générales'!C6","v":0}]
[]
[null,"Mois","Janvier","Février","Mars","Avril","Mai","Juin","Juillet","Août","Septembre","Octobre","Novembre","Décembre","Total"]
[null,null,1,2,3,4,5,6,7,8,9,10,11,12]
[null,"COÛTS FIXES"]
[null,"Frais de financement",{"$f":"'5 Financement'!$G$16","v":219.35455823001593},{"$f":"'5 Financement'!$G$16","v":219.35455823001593},{"$f":"'5 Financement'!$G$16","v":219.35455823001593},{"$f":"'5 Financement'!$G$16","v":219.35455823001593},{"$f":"'5 Financement'!$G$16","v":219.35455823001593},{"$f":"'5 Financement'!$G$16","v":219.35455823001593},{"$f":"'5 Financement'!$G$16","v":219.35455823001593},{"$f":"'5 Financement'!$G$16","v":219.35455823001593},{"$f":"'5 Financement'!$G$16","v":219.35455823001593},{"$f":"'5 Financement'!$G$16","v":219.35455823001593},{"$f":"'5 Financement'!$G$16","v":219.35455823001593},{"$f":"'5 Financement'!$G$16","v":219.35455823001593},{"$f":"+SUM(C9:N9)","v":2632.2546987601909}]
[null,"Coûts d'amortissement",{"$f":"'2 Équipements et actifs'!$G$38/12","v":231.4814814814815},{"$f":"'2 Équipements et actifs'!$G$38/12","v":231.4814814814815},{"$f":"'2 Équipements et actifs'!$G$38/12","v":231.4814814814815},{"$f":"'2 Équipements et actifs'!$G$38/12","v":231.4814814814815},{"$f":"'2 Équipements et actifs'!$G$38/12","v":231.4814814814815},{"$f":"'2 Équipements et actifs'!$G$38/12","v":231.4814814814815},{"$f":"'2 Équipements et actifs'!$G$38/12","v":231.4814814814815},{"$f":"'2 Équipements et actifs'!$G$38/12","v":231.4814814814815},{"$f":"'2 Équipements et actifs'!$G$38/12","v":231.4814814814815},{"$f":"'2 Équipements et actifs'!$G$38/12","v":231.4814814814815},{"$f":"'2 Équipements et actifs'!$G$38/12","v":231.4814814814815},{"$f":"'2 Équipements et actifs'!$G$38/12","v":231.4814814814815},{"$f":"+SUM(C10:N10)","v":2777.7777777777774}]
[null,"Cotisations des membres ",{"$nulls":12},{"$f":"+SUM(C11:N11)","v":0}]
[null,"Frais d'assurance",{"$nulls":12},{"$f":"+SUM(C12:N12)","v":0}]
[null,"Impôt foncier",{"$nulls":12},0]
[null,"Cotisation au Fonds social",{"$nulls":12},{"$f":"+SUM(C14:N14)","v":0}]
[null,"Frais de location d'équipement",{"$nulls":12},0]
[null,"Frais de location du terrain",{"$nulls":12},{"$f":"+SUM(C16:N16)","v":0}]
[null,"-",{"$nulls":12},{"$f":"+SUM(C17:N17)","v":0}]
[null,"-",{"$nulls":12},0]
[null,"TOTAL DES FRAIS FIXES par mois",{"$f":"+SUM(C9:C18)","v":450.83603971149739},{"$f":"+SUM(D9:D18)","v":450.83603971149739},450.83603971149739,450.83603971149739,450.83603971149739,450.83603971149739,450.83603971149739,450.83603971149739,450.83603971149739,450.83603971149739,450.83603971149739,450.83603971149739,{"$f":"+SUM(O9:O18)","v":5410.0324765379683}]
[]
{"$rows_left_out":20}
{"sheet":"Graph table","index":8,"n_rows":33,"n_cols":3,"rows_kept":33,"cut":false,"hidden":true,"merged":[]}
[]
[]
[]
[]
[]
[]
["FIXED COSTS",{"$f":"'6 Coûts Fixes et Variables'!B9","v":"Frais de financement"},{"$f":"'6 Coûts Fixes et Variables'!O9","v":2632.2546987601909}]
[null,{"$f":"'6 Coûts Fixes et Variables'!B10","v":"Coûts d'amortissement"},{"$f":"'6 Coûts Fixes et Variables'!O10","v":2777.7777777777774}]
[null,{"$f":"'6 Coûts Fixes et Variables'!B11","v":"Cotisations des membres "},{"$f":"'6 Coûts Fixes et Variables'!O11","v":0}]
[null,{"$f":"'6 Coûts Fixes et Variables'!B12","v":"Frais d'assurance"},{"$f":"'6 Coûts Fixes et Variables'!O12","v":0}]
[null,{"$f":"'6 Coûts Fixes et Variables'!B13","v":"Impôt foncier"},{"$f":"'6 Coûts Fixes et Variables'!O13","v":0}]
[null,{"$f":"'6 Coûts Fixes et Variables'!B14","v":"Cotisation au Fonds social"},{"$f":"'6 Coûts Fixes et Variables'!O14","v":0}]
[null,{"$f":"'6 Coûts Fixes et Variables'!B15","v":"Frais de location d'équipement"},{"$f":"'6 Coûts Fixes et Variables'!O15","v":0}]
[null,{"$f":"'6 Coûts Fixes et Variables'!B16","v":"Frais de location du terrain"},{"$f":"'6 Coûts Fixes et Variables'!O16","v":0}]
[null,{"$f":"'6 Coûts Fixes et Variables'!B17","v":"-"},{"$f":"'6 Coûts Fixes et Variables'!O17","v":0}]
[null,{"$f":"'6 Coûts Fixes et Variables'!B18","v":"-"},{"$f":"'6 Coûts Fixes et Variables'!O18","v":0}]
[{"$f":"'6 Coûts Fixes et Variables'!B21","v":"FRAIS VARIABLES"},{"$f":"'6 Coûts Fixes et Variables'!B22","v":"Coûts du carburant et du gaz"},{"$f":"'6 Coûts Fixes et Variables'!O22","v":50}]
[null,{"$f":"'6 Coûts Fixes et Variables'!B23","v":"Frais d'eau"},{"$f":"'6 Coûts Fixes et Variables'!O23","v":0}]
[null,{"$f":"'6 Coûts Fixes et Variables'!B24","v":"Frais d'électricité"},{"$f":"'6 Coûts Fixes et Variables'!O24","v":0}]
[null,{"$f":"'6 Coûts Fixes et Variables'!B25","v":"Frais de transport "},{"$f":"'6 Coûts Fixes et Variables'!O25","v":0}]
{"$rows_left_out":14}
{"sheet":"7 Compte de résultat","index":9,"n_rows":64,"n_cols":10,"rows_kept":64,"cut":false,"hidden":false,"merged":[[63,3,63,7],[1,1,1,8],[3,6,3,7],[0,0,0,8],[57,3,57,5],[59,3,59,4],[60,3,60,4],[61,3,61,4],[62,3,62,4],[59,5,59,6],[60,5,60,6],[61,5,61,6],[62,5,62,6]]}
["INVESTIR – Outil d’analyse de l’exploitation agricole"]
[null,"7 COMPTE DE RÉSULTAT DE L’EXPLOITATION"]
[]
[{"$nulls":5},"Code de l’exploitation",{"$f":"'1 Informations générales'!C6","v":0}]
[]
[null,null,"+","Valeur brute de production de cultures saisonnières",0,{"$f":"'1 Informations générales'!$D$13","v":"€"},"+",{"$f":"IF($E$16=0,0,(+E6/$E$16)*(1-$E$14))","v":0}]
[null,null,"+","Valeur brute de production de produits dérivés des cultures saisonnières",0,{"$f":"'1 Informations générales'!$D$13","v":"€"},"+",{"$f":"IF($E$16=0,0,(+E7/$E$16)*(1-$E$14))","v":0}]
[null,null,"+","Valeur brute de production de cultures pluriannuelles",0,{"$f":"'1 Informations générales'!$D$13","v":"€"},"+",0]
[null,null,"+","Valeur brute de production de produits dérivés des cultures pluriannuelles",0,{"$f":"'1 Informations générales'!$D$13","v":"€"},"+",0]
[null,null,"+","Valeur brute de production d’animaux d’élevage : ",0,{"$f":"'1 Informations générales'!$D$13","v":"€"},"+",0]
[null,null,"+","Valeur brute de production de produits dérivés d’animaux d’élevage ",0,{"$f":"'1 Informations générales'!$D$13","v":"€"},"+",0]
[null,null,"+","Valeur brute des autres recettes : ",0,{"$f":"'1 Informations générales'!$D$13","v":"€"},"+",0]
[]
[null,null,"-","Pertes anticipées sur le total des ventes (facteur de réduction)",0.1,"%"]
[]
[null,null,"=","REVENU BRUT DE L’EXPLOITATION",{"$f":"SUM(E6:E12)-(SUM(E6:E12)*E14)","v":0},{"$f":"'1 Informations générales'!$D$13","v":"€"},"=",{"$f":"SUM(H6:H12)","v":0}]
[]
[]
[null,null,"-","Total des coûts fixes",0,{"$f":"'1 Informations générales'!$D$13","v":"€"},"+",{"$f":"IF($E$21=0,0,+E19/$E$21)","v":0}]
[null,null,"-","Total des coûts variables",0,{"$f":"'1 Informations générales'!$D$13","v":"€"},"+",{"$f":"IF($E$21=0,0,+E20/$E$21)","v":0}]
{"$rows_left_out":11}
{"sheet":"Calcul des prix des cultures","index":10,"n_rows":45,"n_cols":14,"rows_kept":45,"cut":false,"hidden":false,"merged":[[1,0,1,13],[4,0,4,13],[14,0,14,13],[24,0,24,13],[0,0,0,13]]}
["INVESTIR – Outil d’analyse de l’exploitation agricole"]
["Feuille supplémentaire permettant de calculer les coûts annuels moyens de certaines cultures et de certains animaux d’élevage sur la base des variations mensuelles saisonnières"]
[null,"Janvier","Février","Mars","Avril","Mai","Juin","Juillet","Août","Septembre","Octobre","Novembre","Décembre","MOYENNE"]
[null,"Prix unitaire","Prix unitaire","Prix unitaire","Prix unitaire","Prix unitaire","Prix unitaire","Prix unitaire","Prix unitaire","Prix unitaire","Prix unitaire","Prix unitaire","Prix unitaire","Prix unitaire"]
["Cultures saisonnières"]
[{"$f":"'3 Recettes cultures & élévage'!B10","v":0},{"$nulls":12},{"$f":"AVERAGE(B6:M6)","v":{"$error":"#DIV/0!"}}]
[{"$f":"'3 Recettes cultures & élévage'!B11","v":0},{"$nulls":12},{"$f":"AVERAGE(B7:M7)","v":{"$error":"#DIV/0!"}}]
[{"$f":"'3 Recettes cultures & élévage'!B12","v":0},{"$nulls":12},{"$error":"#DIV/0!"}]
[{"$f":"'3 Recettes cultures & élévage'!B13","v":0},{"$nulls":12},{"$error":"#DIV/0!"}]
[{"$f":"'3 Recettes cultures & élévage'!B14","v":0},{"$nulls":12},{"$error":"#DIV/0!"}]
[{"$f":"'3 Recettes cultures & élévage'!B15","v":"Produits dérivés:"}]
[{"$f":"'3 Recettes cultures & élévage'!B16","v":0},{"$nulls":12},{"$error":"#DIV/0!"}]
[{"$f":"'3 Recettes cultures & élévage'!B17","v":0},{"$nulls":12},{"$error":"#DIV/0!"}]
[{"$f":"'3 Recettes cultures & élévage'!B18","v":0},{"$nulls":12},{"$error":"#DIV/0!"}]
["Cultures pluriannuelles"]
[{"$f":"'3 Recettes cultures & élévage'!B26","v":0},{"$nulls":12},{"$error":"#DIV/0!"}]
[{"$f":"'3 Recettes cultures & élévage'!B27","v":0},{"$nulls":12},{"$error":"#DIV/0!"}]
[{"$f":"'3 Recettes cultures & élévage'!B28","v":0},{"$nulls":12},{"$error":"#DIV/0!"}]
[{"$f":"'3 Recettes cultures & élévage'!B29","v":0},{"$nulls":12},{"$error":"#DIV/0!"}]
[{"$f":"'3 Recettes cultures & élévage'!B30","v":0},{"$nulls":12},{"$error":"#DIV/0!"}]
{"$rows_left_out":26}
{"sheet":"Contrôle rapide","index":11,"n_rows":33,"n_cols":9,"rows_kept":33,"cut":false,"hidden":false,"merged":[[0,0,0,3],[1,1,1,3],[32,1,32,3],[6,5,6,8],[33,2,33,3],[4,1,4,3],[18,1,18,3]]}
["INVESTIR – Outil d’analyse de l’exploitation agricole"]
[null,"Contrôle rapide"]
[]
[]
[null,"Dépenses annuelles"]
[null,"Nature de la dépense","Exemples","Montant annuel"]
[null,"Coûts des cultures saisonnières","Semis, pesticides, engrais, protection, etc.",null,null,"Calculatrice"]
[null,"Dépenses liées aux cultures pérennes","Semis, pesticides, engrais, protection, etc.",null,null,null,"additionner :","multiplier :","diviser :"]
[null,"Dépenses liées au bétail ","Nouveau bétail, fourrage, abattage, services vétérinaires, etc.",null,null,"a."]
[null,"Exploitation et maintenance \n- Infrastructure","Rénovations de bâtiments, peinture, plâtrage, clôtures, électricité, eau, etc. ",null,null,"b."]
[null,"Exploitation et maintenance\n- Équipements fixes\n","Pompes à eau, matériel d'irrigation, matériel d'emballage, broyage, carburant, pièces de rechange, réparations, etc.",null,null,"c."]
[null,"Exploitation et maintenance \n- Équipement mobile","Tracteur, camions, charrue, remorque, carburant, pièces de rechange, réparations, etc.",null,null,"d."]
[null,"Main-d'œuvre","Salaires, avantages sociaux, salaire propre etc.",null,null,"e."]
[null,"Vente et distribution","Emballage, frais, publicité, etc.",null,null,"Total",{"$f":"SUM(G9:G13)","v":0},{"$f":"H9*H10","v":0},{"$f":"I9/I10","v":{"$error":"#DIV/0!"}}]
[null,"Gestion et administration","Loyer, consommables de bureau, assurances, adhésions, remboursements de prêts, etc."]
[]
[null,null,null,{"$f":"SUM(D7:D16)","v":0}]
[]
[null,"Revenu annuel"]
[null,"Type de revenu","Exemples","Montant annuel"]
{"$rows_left_out":14}
{"sheet":"Feuille de traduction","index":12,"n_rows":23,"n_cols":3,"rows_kept":23,"cut":false,"hidden":false,"merged":[[1,0,1,2],[4,0,4,4]]}
[null,"  "]
["Feuille de traduction"]
[]
["Introduction"]
["Certains textes utilisés dans cet outil sont utilisés dans des formules qui utilisent la reconnaissance de texte. Afin de préserver l'intégrité et la fonctionnalité de la formule, ces textes resteront en anglais. Une liste de ces textes et leur traduction correspondante est compilée ci-dessous :"]
["Texte original en anglais","Feuille","Traduction française"]
["Acre","1. Informations générales","acre"]
["ha","1. Informations générales","hectare"]
["kg","1. Informations générales","kilo"]
["metric ton","1. Informations générales","tonne métrique "]
["no crops","7. Compte de résultat de l’exploitation","pas de cultures"]
["pound (lb)","1. Informations générales","livres"]
["quintal","1. Informations générales","quintal"]
["Sq. feet ","1. Informations générales","pieds carrés"]
["Sq. yard","1. Informations générales","cour carrée"]
["Sq.km","1. Informations générales","kilomètre carré"]
["Sq.m","1. Informations générales","mètre carré"]
["Daily egg yield","3 Recettes cultures & élévage","Rendement journalier en œufs"]
["Daily milk yield","3 Recettes cultures & élévage","Rendement quotidien en lait"]
["Number of chickens","3 Recettes cultures & élévage","Nombre de poulets"]
{"$rows_left_out":3}