{"text_format":"2","workbook":"xlsx","n_sheets":7,"sheets":["READ ME","Input","Output","Cashflow Calculation","Loan Repayment Solar","Loan Repayment Grid","Loan Repayment Diesel"],"not_rendered":{"charts":8,"images":6,"macros":0,"external_links":0,"defined_names":200,"comments":0,"pivot_tables":0},"unopened":[],"bounds":{"document_bytes":16777216,"sheet_cells":100000,"run_cost":"one","rows_first":2000,"rows_last":500,"rows_between":2000,"halvings":0,"cell_chars":16384,"cell_head_chars":4096},"cells_cut":0,"cells_raw":0,"read":"whole","date_system":"1900"}

{"sheet":"READ ME","index":0,"n_rows":101,"n_cols":7,"rows_kept":101,"cut":false,"hidden":false,"merged":[[10,3,10,9],[15,3,15,9],[17,3,17,9],[92,3,98,9],[100,3,100,5],[18,3,22,9],[39,6,41,9],[39,3,41,5],[50,3,50,4],[50,5,50,9],[51,3,53,4],[51,5,52,9],[53,5,53,7],[54,3,54,4],[54,5,54,7],[42,3,43,5],[23,3,23,9],[77,3,90,9],[49,3,49,4],[49,5,49,7],[45,3,45,9],[46,3,46,4],[46,5,46,6],[42,6,43,9],[47,3,48,4],[47,5,48,9],[36,3,36,9],[25,3,25,9],[56,3,75,9]]}
{"$rows_empty":10}
[null,null,null,"Read Me Sheet"]
[]
[]
[]
[]
[null,null,null,"INVEST – Payback Tool"]
[]
[null,null,null,"Introduction"]
[null,null,null,"This tool allows for a comparative assessment between income and three different irrigation pumping options. Information required for using this tool includes investment and operational costs for the different pumping systems, anticipated income from agricultural production and basic economic conditions (e.g. inflation rate). An alternative tool is available under: "]
[]
[]
[]
[]
[null,null,null,"http://www.fao.org/energy/agrifood-chains/power-irrigation-tool/en/ "]
[]
[null,null,null,"Tips & Tricks"]
{"$rows_empty":10}
[null,null,null,"Overview"]
[null,null,null,"This tool comprises the following sheets:"]
{"$rows_left_out":26}
{"sheet":"Input","index":1,"n_rows":119,"n_cols":11,"rows_kept":119,"cut":false,"hidden":false,"merged":[[99,9,101,10],[91,3,91,7],[59,3,59,7],[29,3,29,7],[118,4,118,5],[87,4,87,5],[19,6,20,10],[0,1,0,8],[96,1,97,1],[95,8,95,10],[17,5,18,10],[15,5,16,10],[11,5,12,10],[9,5,10,10],[23,6,24,10],[21,6,22,10],[5,1,5,10],[36,1,37,1],[65,1,66,1],[55,4,55,5],[63,8,63,10],[67,8,68,10]]}
[null,"INVEST - Payback Tool"]
[]
[null,"This INPUT sheet requires entry of values, which then serve the results displayed in the next OUTPUT sheet."]
[null,null," "]
[]
[null,"Basic assumptions"]
[]
[null,"Currency used for calculation:",null,null,null,"enter any currency"]
[]
[null,"Inflation",null,null,null,"the national percentage rate for the devaluation of money per year (provided by national statistics)"]
[]
[null,"Discount rate",null,null,null,"the annual rate used to determine the present value of future cash flows (Tip: simplified discount rate is often equal to interest rate earned from bank savings or treasury bonds)"]
[]
[null,"Annual profit margin increase",null,null,null,"the rate at which the farmer will increase prices every year (calculated as per own records)"]
[]
[null,"Annual fuel price increase",null,null,null,"the rate at which the fuel (Diesel, petrol or LPG) will increase every year (as provided by national regulator or from national energy statistics)"]
[]
[null,"Annual electricity price increase",null,null,null,"the rate at which the grid electricity prices will increase every year (provided by national electricity regulator or utility)"]
[]
[null,"Water levy (surcharge for water utilisation rights)",null,null,null,{"$f":"E8 & \" per m³\"","v":" per m³"},"the water price per m3 as determined by government, local authority for utilising shared water resources with own pumping systems"]
{"$rows_left_out":100}
{"sheet":"Output","index":2,"n_rows":35,"n_cols":18,"rows_kept":35,"cut":false,"hidden":false,"merged":[[12,7,14,14],[5,7,5,14],[0,6,0,11],[4,1,4,5],[19,7,19,11],[19,13,19,17],[19,1,19,5],[6,7,8,14],[9,7,11,14]]}
[{"$nulls":6},"INVEST – Payback Tool"]
[]
[{"$nulls":6},"This OUTPUT sheet summarises the results as per the entries in the afore completed INPUT sheet."]
[]
[null,"Basic assumptions"]
[null,"Total water need per day",null,null,{"$f":"Input!E22 & \" m³ per day\"","v":" m³ per day"},null,null,"Note:"]
[{"$nulls":7},"If \"not feasible\" is displayed for the Internal Rate of Return (IRR) then the IRR value is below 0%."]
[null,"Total income per year",null,null,{"$f":"TEXT(Input!E24,\"#.##0\") &\" \" & Input!E8","v":"0 "}]
[]
[null,"Total investment amount per year",null,null,{"$f":"TEXT(Input!E24,\"#.##0\")*Input!E26 &\" \" & Input!E8","v":"0 "},null,null,"If a negative (-) Net Present Value (NPV) is displayed then the investment is not feasible."]
[]
[null,"Inflation",null,null,{"$f":"Input!E10","v":0}]
[{"$nulls":7},"If \"no payback\" is displayed for Years for Payback then system capital and/or operating expenses exceed income within 25 years"]
[null,"Discount rate",null,null,{"$f":"Input!E12","v":0}]
[]
[null,"Annual profit margin increase",null,null,{"$f":"Input!E14","v":0}]
[]
[null,"Annual fuel price increase",null,null,{"$f":"Input!E16","v":0}]
[]
[null,{"$f":"\"Analysis for \" &Input!D30","v":"Analysis for Solar powered irrigation system"},{"$nulls":5},{"$f":"\"Analysis for \" &Input!D60","v":"Analysis for Grid powered irrigation system"},{"$nulls":5},{"$f":"\"Analysis for \" &Input!D92","v":"Analysis for Diesel powered irrigation system"}]
{"$rows_left_out":16}
{"sheet":"Cashflow Calculation","index":3,"n_rows":197,"n_cols":29,"rows_kept":197,"cut":false,"hidden":true,"merged":[[96,15,96,16],[97,13,97,14],[97,15,97,16],[154,1,155,1],[180,5,180,7],[50,1,51,1],[88,1,89,1],[96,13,96,14]]}
["Annual profit margin increase:",{"$f":"Input!E14","v":0}]
["Inflation rate:",{"$f":"Input!E10","v":0}]
["Income-Gross farm profit/year:",{"$f":"Input!E24","v":0},{"$f":"IF(Input!$E$8=\"\",\"\",Input!$E$8)","v":""}]
["Percentage profit to invest",{"$f":"Input!E26","v":0}]
["Fuel price increase/year: ",{"$f":"Input!E16","v":0}]
["Electricity price increase/year: ",{"$f":"Input!E18","v":0}]
["Discount rate",{"$f":"Input!E12","v":0}]
["Water levy",{"$f":"Input!E20","v":0},{"$f":"IF(Input!$E$8=\"\",\"\",Input!$E$8)","v":""}]
["Total water need per day",{"$f":"Input!E22","v":0},{"$f":"Input!F22","v":"m³ per day "}]
[]
[null,null,"year",0,1,2,3,4,5,6,7,8,9,10,11,12,13,14,15,16,17,18,19,20,21,22,23,24,25]
[null,null,{"$f":"IF(Input!$E$8=\"\",\"\",Input!$E$8)","v":""},0,{"$f":"B3*B4","v":0},{"$f":"E12*(1+(1*$B$1))","v":0},{"$f":"F12*(1+(1*$B$1))","v":0},{"$f":"G12*(1+(1*$B$1))","v":0},0,0,0,0,0,0,0,0,0,0,0,0,0,0,0,0,0,0,0,0,0]
["Capital investment per year:"]
[true,null,"accumulated",{"$f":"IF($A$14=TRUE,D15,NA())","v":0},{"$f":"IF($A$14=TRUE,E15,NA())","v":0},{"$f":"IF($A$14=TRUE,F15,NA())","v":0},0,0,0,0,0,0,0,0,0,0,0,0,0,0,0,0,0,0,0,0,0,0,0]
[null,null,null,0,{"$f":"SUM(E12)","v":0},{"$f":"SUM($E$12:F12)","v":0},{"$f":"SUM($E$12:G12)","v":0},{"$f":"SUM($E$12:H12)","v":0},{"$f":"SUM($E$12:I12)","v":0},{"$f":"SUM($E$12:J12)","v":0},{"$f":"SUM($E$12:K12)","v":0},{"$f":"SUM($E$12:L12)","v":0},{"$f":"SUM($E$12:M12)","v":0},{"$f":"SUM($E$12:N12)","v":0},{"$f":"SUM($E$12:O12)","v":0},{"$f":"SUM($E$12:P12)","v":0},{"$f":"SUM($E$12:Q12)","v":0},{"$f":"SUM($E$12:R12)","v":0},{"$f":"SUM($E$12:S12)","v":0},{"$f":"SUM($E$12:T12)","v":0},{"$f":"SUM($E$12:U12)","v":0},{"$f":"SUM($E$12:V12)","v":0},{"$f":"SUM($E$12:W12)","v":0},{"$f":"SUM($E$12:X12)","v":0},{"$f":"SUM($E$12:Y12)","v":0},{"$f":"SUM($E$12:Z12)","v":0},{"$f":"SUM($E$12:AA12)","v":0},{"$f":"SUM($E$12:AB12)","v":0},{"$f":"SUM($E$12:AC12)","v":0}]
[]
[]
[]
[]
[]
{"$rows_left_out":155}
{"sheet":"Loan Repayment Solar","index":4,"n_rows":373,"n_cols":10,"rows_kept":373,"cut":false,"hidden":true,"merged":[[0,0,0,4],[0,5,0,9],[2,1,2,3],[2,5,2,7]]}
["Loan Repayment:",{"$nulls":4},{"$f":"Input!D30","v":"Solar powered irrigation system"}]
["Bank:",{"$f":"Input!E56","v":0}]
[null,"Enter Values",null,null,null,"Loan Summary"]
[null,null,"Loan Amount",{"$f":"Input!E53","v":0},null,null,"Scheduled Payment",{"$f":"IF(Values_Entered,-PMT(Interest_Rate/Num_Pmt_Per_Year,Loan_Years*Num_Pmt_Per_Year,Loan_Amount),\"0\")","v":"0"}]
[null,null,"Annual Interest Rate",{"$f":"Input!E54","v":0},null,null,"Scheduled Number of Payments",{"$f":"IF(Values_Entered,Loan_Years*Num_Pmt_Per_Year,\"\")","v":""}]
[null,null,"Loan Period in Years",{"$f":"Input!E55","v":0},null,null,"Actual Number of Payments",{"$f":"IF(Values_Entered,Number_of_Payments,\"\")","v":""}]
[null,null,"Number of Payments Per Year",1,null,null,"Total Early Payments",{"$f":"IF(Values_Entered,SUMIF(Beg_Bal,\">0\",Extra_Pay),\"\")","v":""}]
[null,null,"Start Date of Loan","2017-01-01",null,null,"Total Interest",{"$f":"IF(Values_Entered,SUMIF(Beg_Bal,\">0\",Int),\"\")","v":""}]
[null,null,"Optional Extra Payments",0]
[]
[]
["PmtNo.","Payment Date","Beginning Balance","Scheduled Payment","Extra Payment","Total Payment","Principal","Interest","Ending Balance","Cumulative Interest"]
[]
[{"$f":"IF(Values_Entered,1,\"\")","v":""},{"$f":"IF(Pay_Num<>\"\",DATE(YEAR(Loan_Start),MONTH(Loan_Start)+(Pay_Num)*12/Num_Pmt_Per_Year,DAY(Loan_Start)),\"\")","v":""},{"$f":"IF(Values_Entered,Loan_Amount,\"\")","v":""},{"$f":"IF(Pay_Num<>\"\",Scheduled_Monthly_Payment,\"\")","v":""},{"$f":"IF(AND(Pay_Num<>\"\",Sched_Pay+Scheduled_Extra_Payments<Beg_Bal),Scheduled_Extra_Payments,IF(AND(Pay_Num<>\"\",Beg_Bal-Sched_Pay>0),Beg_Bal-Sched_Pay,IF(Pay_Num<>\"\",0,\"\")))","v":{"$error":"#VALUE!"}},{"$f":"IF(AND(Pay_Num<>\"\",Sched_Pay+Extra_Pay<Beg_Bal),Sched_Pay+Extra_Pay,IF(Pay_Num<>\"\",Beg_Bal,\"\"))","v":{"$error":"#VALUE!"}},{"$f":"IF(Pay_Num<>\"\",Total_Pay-Int,\"\")","v":""},{"$f":"IF(Pay_Num<>\"\",Beg_Bal*(Interest_Rate/Num_Pmt_Per_Year),\"\")","v":""},{"$f":"IF(AND(Pay_Num<>\"\",Sched_Pay+Extra_Pay<Beg_Bal),Beg_Bal-Princ,IF(Pay_Num<>\"\",0,\"\"))","v":{"$error":"#VALUE!"}},{"$f":"SUM($H$14:$H14)","v":0}]
[{"$f":"IF(Values_Entered,A14+1,\"\")","v":""},"",{"$f":"IF(Pay_Num<>\"\",I14,\"\")","v":""},{"$f":"IF(Pay_Num<>\"\",Scheduled_Monthly_Payment,\"\")","v":""},{"$error":"#VALUE!"},{"$error":"#VALUE!"},{"$f":"IF(Pay_Num<>\"\",Total_Pay-Int,\"\")","v":""},{"$f":"IF(Pay_Num<>\"\",Beg_Bal*Interest_Rate/Num_Pmt_Per_Year,\"\")","v":""},{"$error":"#VALUE!"},{"$f":"SUM($H$14:$H15)","v":0}]
[{"$f":"IF(Values_Entered,A15+1,\"\")","v":""},"","",{"$f":"IF(Pay_Num<>\"\",Scheduled_Monthly_Payment,\"\")","v":""},{"$error":"#VALUE!"},{"$error":"#VALUE!"},"","",{"$error":"#VALUE!"},{"$f":"SUM($H$14:$H16)","v":0}]
[{"$f":"IF(Values_Entered,A16+1,\"\")","v":""},"","",{"$f":"IF(Pay_Num<>\"\",Scheduled_Monthly_Payment,\"\")","v":""},{"$error":"#VALUE!"},{"$error":"#VALUE!"},"","",{"$error":"#VALUE!"},{"$f":"SUM($H$14:$H17)","v":0}]
[{"$f":"IF(Values_Entered,A17+1,\"\")","v":""},"","","",{"$error":"#VALUE!"},{"$error":"#VALUE!"},"","",{"$error":"#VALUE!"},{"$f":"SUM($H$14:$H18)","v":0}]
[{"$f":"IF(Values_Entered,A18+1,\"\")","v":""},"","","",{"$error":"#VALUE!"},{"$error":"#VALUE!"},"","",{"$error":"#VALUE!"},{"$f":"SUM($H$14:$H19)","v":0}]
[{"$f":"IF(Values_Entered,A19+1,\"\")","v":""},"","","",{"$error":"#VALUE!"},{"$error":"#VALUE!"},"","",{"$error":"#VALUE!"},{"$f":"SUM($H$14:$H20)","v":0}]
{"$rows_left_out":354}
{"sheet":"Loan Repayment Grid","index":5,"n_rows":373,"n_cols":10,"rows_kept":373,"cut":false,"hidden":true,"merged":[[0,0,0,4],[0,5,0,9],[2,1,2,3],[2,5,2,7]]}
["Loan Repayment:",{"$nulls":4},{"$f":"Input!D60","v":"Grid powered irrigation system"}]
["Bank:",{"$f":"Input!E88","v":0}]
[null,"Enter Values",null,null,null,"Loan Summary"]
[null,null,"Loan Amount",{"$f":"Input!E85","v":0},null,null,"Scheduled Payment",{"$f":"IF(Values_Entered,-PMT(Interest_Rate/Num_Pmt_Per_Year,Loan_Years*Num_Pmt_Per_Year,Loan_Amount),\"0\")","v":"0"}]
[null,null,"Annual Interest Rate",{"$f":"Input!E86","v":0},null,null,"Scheduled Number of Payments",{"$f":"IF(Values_Entered,Loan_Years*Num_Pmt_Per_Year,\"\")","v":""}]
[null,null,"Loan Period in Years",{"$f":"Input!E87","v":0},null,null,"Actual Number of Payments",{"$f":"IF(Values_Entered,Number_of_Payments,\"\")","v":""}]
[null,null,"Number of Payments Per Year",1,null,null,"Total Early Payments",{"$f":"IF(Values_Entered,SUMIF(Beg_Bal,\">0\",Extra_Pay),\"\")","v":""}]
[null,null,"Start Date of Loan","2017-01-01",null,null,"Total Interest",{"$f":"IF(Values_Entered,SUMIF(Beg_Bal,\">0\",Int),\"\")","v":""}]
[null,null,"Optional Extra Payments",0]
[]
[]
["PmtNo.","Payment Date","Beginning Balance","Scheduled Payment","Extra Payment","Total Payment","Principal","Interest","Ending Balance","Cumulative Interest"]
[]
[{"$f":"IF(Values_Entered,1,\"\")","v":""},{"$f":"IF(Pay_Num<>\"\",DATE(YEAR(Loan_Start),MONTH(Loan_Start)+(Pay_Num)*12/Num_Pmt_Per_Year,DAY(Loan_Start)),\"\")","v":""},{"$f":"IF(Values_Entered,Loan_Amount,\"\")","v":""},{"$f":"IF(Pay_Num<>\"\",Scheduled_Monthly_Payment,\"\")","v":""},{"$f":"IF(AND(Pay_Num<>\"\",Sched_Pay+Scheduled_Extra_Payments<Beg_Bal),Scheduled_Extra_Payments,IF(AND(Pay_Num<>\"\",Beg_Bal-Sched_Pay>0),Beg_Bal-Sched_Pay,IF(Pay_Num<>\"\",0,\"\")))","v":{"$error":"#VALUE!"}},{"$f":"IF(AND(Pay_Num<>\"\",Sched_Pay+Extra_Pay<Beg_Bal),Sched_Pay+Extra_Pay,IF(Pay_Num<>\"\",Beg_Bal,\"\"))","v":{"$error":"#VALUE!"}},{"$f":"IF(Pay_Num<>\"\",Total_Pay-Int,\"\")","v":""},{"$f":"IF(Pay_Num<>\"\",Beg_Bal*(Interest_Rate/Num_Pmt_Per_Year),\"\")","v":""},{"$f":"IF(AND(Pay_Num<>\"\",Sched_Pay+Extra_Pay<Beg_Bal),Beg_Bal-Princ,IF(Pay_Num<>\"\",0,\"\"))","v":{"$error":"#VALUE!"}},{"$f":"SUM($H$14:$H14)","v":0}]
[{"$f":"IF(Values_Entered,A14+1,\"\")","v":""},"",{"$f":"IF(Pay_Num<>\"\",I14,\"\")","v":""},{"$f":"IF(Pay_Num<>\"\",Scheduled_Monthly_Payment,\"\")","v":""},{"$error":"#VALUE!"},{"$error":"#VALUE!"},{"$f":"IF(Pay_Num<>\"\",Total_Pay-Int,\"\")","v":""},{"$f":"IF(Pay_Num<>\"\",Beg_Bal*Interest_Rate/Num_Pmt_Per_Year,\"\")","v":""},{"$error":"#VALUE!"},{"$f":"SUM($H$14:$H15)","v":0}]
[{"$f":"IF(Values_Entered,A15+1,\"\")","v":""},"","",{"$f":"IF(Pay_Num<>\"\",Scheduled_Monthly_Payment,\"\")","v":""},{"$error":"#VALUE!"},{"$error":"#VALUE!"},"","",{"$error":"#VALUE!"},{"$f":"SUM($H$14:$H16)","v":0}]
[{"$f":"IF(Values_Entered,A16+1,\"\")","v":""},"","",{"$f":"IF(Pay_Num<>\"\",Scheduled_Monthly_Payment,\"\")","v":""},{"$error":"#VALUE!"},{"$error":"#VALUE!"},"","",{"$error":"#VALUE!"},{"$f":"SUM($H$14:$H17)","v":0}]
[{"$f":"IF(Values_Entered,A17+1,\"\")","v":""},"","","",{"$error":"#VALUE!"},{"$error":"#VALUE!"},"","",{"$error":"#VALUE!"},{"$f":"SUM($H$14:$H18)","v":0}]
[{"$f":"IF(Values_Entered,A18+1,\"\")","v":""},"","","",{"$error":"#VALUE!"},{"$error":"#VALUE!"},"","",{"$error":"#VALUE!"},{"$f":"SUM($H$14:$H19)","v":0}]
[{"$f":"IF(Values_Entered,A19+1,\"\")","v":""},"","","",{"$error":"#VALUE!"},{"$error":"#VALUE!"},"","",{"$error":"#VALUE!"},{"$f":"SUM($H$14:$H20)","v":0}]
{"$rows_left_out":354}
{"sheet":"Loan Repayment Diesel","index":6,"n_rows":373,"n_cols":10,"rows_kept":373,"cut":false,"hidden":true,"merged":[[0,0,0,4],[0,5,0,9],[2,1,2,3],[2,5,2,7]]}
["Loan Repayment:",{"$nulls":4},{"$f":"Input!D60","v":"Grid powered irrigation system"}]
["Bank:",{"$f":"Input!E119","v":0}]
[null,"Enter Values",null,null,null,"Loan Summary"]
[null,null,"Loan Amount",{"$f":"Input!E116","v":0},null,null,"Scheduled Payment",{"$f":"IF(Values_Entered,-PMT(Interest_Rate/Num_Pmt_Per_Year,Loan_Years*Num_Pmt_Per_Year,Loan_Amount),\"0\")","v":"0"}]
[null,null,"Annual Interest Rate",{"$f":"Input!E117","v":0},null,null,"Scheduled Number of Payments",{"$f":"IF(Values_Entered,Loan_Years*Num_Pmt_Per_Year,\"\")","v":""}]
[null,null,"Loan Period in Years",{"$f":"Input!E118","v":0},null,null,"Actual Number of Payments",{"$f":"IF(Values_Entered,Number_of_Payments,\"\")","v":""}]
[null,null,"Number of Payments Per Year",1,null,null,"Total Early Payments",{"$f":"IF(Values_Entered,SUMIF(Beg_Bal,\">0\",Extra_Pay),\"\")","v":""}]
[null,null,"Start Date of Loan","2017-01-01",null,null,"Total Interest",{"$f":"IF(Values_Entered,SUMIF(Beg_Bal,\">0\",Int),\"\")","v":""}]
[null,null,"Optional Extra Payments",0]
[]
[]
["PmtNo.","Payment Date","Beginning Balance","Scheduled Payment","Extra Payment","Total Payment","Principal","Interest","Ending Balance","Cumulative Interest"]
[]
[{"$f":"IF(Values_Entered,1,\"\")","v":""},{"$f":"IF(Pay_Num<>\"\",DATE(YEAR(Loan_Start),MONTH(Loan_Start)+(Pay_Num)*12/Num_Pmt_Per_Year,DAY(Loan_Start)),\"\")","v":""},{"$f":"IF(Values_Entered,Loan_Amount,\"\")","v":""},{"$f":"IF(Pay_Num<>\"\",Scheduled_Monthly_Payment,\"\")","v":""},{"$f":"IF(AND(Pay_Num<>\"\",Sched_Pay+Scheduled_Extra_Payments<Beg_Bal),Scheduled_Extra_Payments,IF(AND(Pay_Num<>\"\",Beg_Bal-Sched_Pay>0),Beg_Bal-Sched_Pay,IF(Pay_Num<>\"\",0,\"\")))","v":{"$error":"#VALUE!"}},{"$f":"IF(AND(Pay_Num<>\"\",Sched_Pay+Extra_Pay<Beg_Bal),Sched_Pay+Extra_Pay,IF(Pay_Num<>\"\",Beg_Bal,\"\"))","v":{"$error":"#VALUE!"}},{"$f":"IF(Pay_Num<>\"\",Total_Pay-Int,\"\")","v":""},{"$f":"IF(Pay_Num<>\"\",Beg_Bal*(Interest_Rate/Num_Pmt_Per_Year),\"\")","v":""},{"$f":"IF(AND(Pay_Num<>\"\",Sched_Pay+Extra_Pay<Beg_Bal),Beg_Bal-Princ,IF(Pay_Num<>\"\",0,\"\"))","v":{"$error":"#VALUE!"}},{"$f":"SUM($H$14:$H14)","v":0}]
[{"$f":"IF(Values_Entered,A14+1,\"\")","v":""},"",{"$f":"IF(Pay_Num<>\"\",I14,\"\")","v":""},{"$f":"IF(Pay_Num<>\"\",Scheduled_Monthly_Payment,\"\")","v":""},{"$error":"#VALUE!"},{"$error":"#VALUE!"},{"$f":"IF(Pay_Num<>\"\",Total_Pay-Int,\"\")","v":""},{"$f":"IF(Pay_Num<>\"\",Beg_Bal*Interest_Rate/Num_Pmt_Per_Year,\"\")","v":""},{"$error":"#VALUE!"},{"$f":"SUM($H$14:$H15)","v":0}]
[{"$f":"IF(Values_Entered,A15+1,\"\")","v":""},"","",{"$f":"IF(Pay_Num<>\"\",Scheduled_Monthly_Payment,\"\")","v":""},{"$error":"#VALUE!"},{"$error":"#VALUE!"},"","",{"$error":"#VALUE!"},{"$f":"SUM($H$14:$H16)","v":0}]
[{"$f":"IF(Values_Entered,A16+1,\"\")","v":""},"","",{"$f":"IF(Pay_Num<>\"\",Scheduled_Monthly_Payment,\"\")","v":""},{"$error":"#VALUE!"},{"$error":"#VALUE!"},"","",{"$error":"#VALUE!"},{"$f":"SUM($H$14:$H17)","v":0}]
[{"$f":"IF(Values_Entered,A17+1,\"\")","v":""},"","","",{"$error":"#VALUE!"},{"$error":"#VALUE!"},"","",{"$error":"#VALUE!"},{"$f":"SUM($H$14:$H18)","v":0}]
[{"$f":"IF(Values_Entered,A18+1,\"\")","v":""},"","","",{"$error":"#VALUE!"},{"$error":"#VALUE!"},"","",{"$error":"#VALUE!"},{"$f":"SUM($H$14:$H19)","v":0}]
[{"$f":"IF(Values_Entered,A19+1,\"\")","v":""},"","","",{"$error":"#VALUE!"},{"$error":"#VALUE!"},"","",{"$error":"#VALUE!"},{"$f":"SUM($H$14:$H20)","v":0}]
{"$rows_left_out":353}