{"text_format":"2","workbook":"xlsx","n_sheets":7,"sheets":["READ ME","Input","Output","Cashflow Calculation","Loan Repayment Solar","Loan Repayment Grid","Loan Repayment Diesel"],"not_rendered":{"charts":8,"images":10,"macros":0,"external_links":0,"defined_names":200,"comments":0,"pivot_tables":0},"unopened":[],"bounds":{"document_bytes":16777216,"sheet_cells":100000,"run_cost":"one","rows_first":2000,"rows_last":500,"rows_between":2000,"halvings":0,"cell_chars":16384,"cell_head_chars":4096},"cells_cut":0,"cells_raw":0,"read":"whole","date_system":"1900"}

{"sheet":"READ ME","index":0,"n_rows":93,"n_cols":7,"rows_kept":93,"cut":false,"hidden":false,"merged":[[23,3,23,9],[69,3,82,9],[49,3,49,4],[49,5,49,7],[56,3,67,9],[45,3,45,9],[46,3,46,4],[46,5,46,6],[42,6,43,9],[47,3,48,4],[47,5,48,9],[36,3,36,9],[25,3,25,9],[10,3,10,9],[15,3,15,9],[17,3,17,9],[84,3,90,9],[92,3,92,5],[18,3,22,9],[39,6,41,9],[39,3,41,5],[50,3,50,4],[50,5,50,9],[51,3,53,4],[51,5,52,9],[53,5,53,7],[54,3,54,4],[54,5,54,7],[42,3,43,5]]}
{"$rows_empty":10}
[null,null,null,"Read Me Sheet"]
[]
[]
[]
[]
[null,null,null,"INVEST – Payback Tool"]
[]
[null,null,null,"Introduction"]
[null,null,null,"This tool allows for a comparative assessment between income and three different irrigation pumping options. Information required for using this tool includes investment and operational costs for the different pumping systems, anticipated income from agricultural production and basic economic conditions (e.g. inflation rate). An alternative tool is available under: "]
[]
[]
[]
[]
[null,null,null,"http://www.fao.org/energy/agrifood-chains/power-irrigation-tool/en/ "]
[]
[null,null,null,"Tips & Tricks"]
{"$rows_empty":10}
[null,null,null,"Overview"]
[null,null,null,"This tool comprises the following sheets:"]
[]
[null,null,null,"1. Input",null,null,"for data entry of anticipated income and expenditure for pumping and irrigation technology"]
[]
[]
[null,null,null,"2. Output",null,null,"for analysis of results automatically generated from Input sheet"]
[]
[]
[null,null,null,"About"]
[null,null,null,"Published by: ",null,"GIZ & FAO"]
[null,null,null,"Responsible:",null,"GIZ project Sustainable Energy for Food - Powering Agriculture"]
[]
[null,null,null,"Contact: ",null,"Powering.Agriculture@giz.de"]
[null,null,null,"Download link: ",null,"https://energypedia.info/wiki/Toolbox_on_SPIS"]
[null,null,null,"About: ",null,"Powering Agriculture: An Energy Grand Challenge for Development. Available at:  "]
[]
[{"$nulls":5},"https://poweringag.org"]
[null,null,null,"Version:",null,"1.0 (March 2018)"]
[]
[null,null,null,"The Toolbox on Solar Powered Irrigation Systems is made possible through the global initiative Powering Agriculture: An Energy Grand Challenge for Development (PAEGC). In 2012, the United States Agency for International Development (USAID), the Swedish International Development Cooperation Agency (Sida), the German Federal Ministry for Economic Cooperation and Development (BMZ), Duke Energy, and the Overseas Private Investment Cooperation (OPIC) combined resources to create the PAEGC initiative. The objective of PAEGC is to support new and sustainable approaches to accelerate the development and deployment of clean energy solutions for increasing agriculture productivity and/or value for farmers and agribusinesses in developing countries and emerging regions that lack access to reliable, affordable clean energy."]
{"$rows_empty":12}
[null,null,null,"The designations employed and the presentation of material in this information product do not imply the expression of any opinion whatsoever on the part of Deutsche Gesellschaft für Internationale Zusammenarbeit (GIZ) GmbH, Food and Agriculture Organization of the United Nations (FAO) or any of the PAEGC Founding Partners concerning the legal or development status of any country, territory, city or area or of its authorities, or concerning the delimitation of its frontiers or boundaries. The mention of specific companies or products of manufacturers, whether or not these have been patented, does not imply that these have been endorsed or recommended by GIZ, FAO, or any of the PAEGC Founding Partners in preference to others of a similar nature that are not mentioned. The views expressed in this information product are those of the author and do not necessarily reflect the views or policies of GIZ, FAO, or any of the PAEGC Founding Partners."]
{"$rows_empty":14}
[null,null,null,"GIZ, FAO and the PAEGC Founding Partners encourage the use, reproduction and dissemination of material in this information product. Except where otherwise indicated, material may be copied, downloaded and printed for private study, research and teaching purposes, or for use in non-commercial products or services, provided that appropriate acknowledgement of GIZ and FAO as the source and copyright holder is given."]
{"$rows_empty":7}
[null,null,null,"© GIZ and FAO, 2018"]

{"sheet":"Input","index":1,"n_rows":116,"n_cols":11,"rows_kept":116,"cut":false,"hidden":false,"merged":[[0,1,0,8],[93,1,94,1],[115,4,115,5],[84,4,84,5],[33,1,34,1],[62,1,63,1],[52,4,52,5],[98,8,98,10],[17,5,18,10],[15,5,16,10],[11,5,12,10],[9,5,10,10],[21,6,22,10],[19,6,20,10]]}
[null,"INVEST - Payback Tool"]
[]
[null,"This INPUT sheet requires entry of values, which then serve the results displayed in the next OUTPUT sheet."]
[null,null," "]
[]
[null,"Basic assumptions"]
[]
[null,"Currency used for calculation:",null,null,null,"use any currency"]
[]
[null,"Inflation",null,null,null,"the national percentage rate for the devaluation of money per year (provided by national statistics)"]
[]
[null,"Discount rate",null,null,null,"the annual rate used to determine the present value of future cash flows (Tip: simplified discount rate is often equal to interest rate earned from bank savings or treasury bonds)"]
[]
[null,"Annual profit margin increase",null,null,null,"the rate at which the farmer will increase prices every year (calculated as per own records)"]
[]
[null,"Annual fuel price increase",null,null,null,"the rate at which the fuel (Diesel, petrol or LPG) will increase every year (as provided by national regulator or from national energy statistics)"]
[]
[null,"Annual electricity price increase",null,null,null,"the rate at which the grid electricity prices will increase every year (provided by national electricity regulator or utility)"]
[]
[null,"Total water pumped per day",null,null,null,"m³ per day ","(as calculated in SAFEGUARD WATER-Water Requirement Tool or provided by pump supplier)"]
[]
[null,"Income: Gross Farm Profit per year",null,null,null,{"$f":"E8","v":0},"per year (as calculated in INVEST-Farm Analysis Tool or from own records)"]
[]
[null,"Proportion of Profit to invest",null,null,null,"% of profit made available for investment into water pumping system"]
[]
[]
[]
[null,"Assumptions for: ",null,"Solar powered irrigation system costs"]
[]
[]
[{"$nulls":6},"Component lifespan"]
[null,null,"Solar panels",null,null,{"$f":"E8","v":0},null,"Years"]
[null,null,"Control unit",null,null,{"$f":"E8","v":0},null,"Years"]
[null,"Initial Capital Costs","Pump",null,null,{"$f":"E8","v":0},null,"Years"]
[null,null,"Wires / tubes",null,null,{"$f":"E8","v":0},null,"Years"]
[null,null,"Water storage",null,null,{"$f":"IF($E$8=\"\",\"\",$E$8)","v":""},null,"Years"]
[null,null,"Irrigation system",null,null,"",null,"Years"]
[null,null,"Drilling",null,null,""]
[null,null,"Installation",null,null,""]
[null,null,"Other costs",null,null,""]
[null,null,"Totals costs",null,{"$f":"SUM(E32:E40)","v":0},""]
[]
[]
[null,"Running costs","Maintenance costs per year:",null,null,{"$f":"E8","v":0}]
[null,null,"Operational costs per year:",null,null,{"$f":"IF($E$8=\"\",\"\",$E$8)","v":""}]
[]
[null,null,"Total costs per year:",null,{"$f":"SUM(E43:E45)","v":0},{"$f":"IF($E$8=\"\",\"\",$E$8)","v":""}]
[]
[]
[null,null,"Loan amount",null,null,{"$f":"IF($E$8=\"\",\"\",$E$8)","v":""}]
[null,"Loan","Interest Rate"]
[null,null,"Investment Period",null,null,"Years"]
[null,null,"Name of Bank"]
[]
[]
[]
[null,"Assumptions for: ",null,"Grid powered irrigation system costs"]
[]
[]
[{"$nulls":6},"Component lifespan"]
[null,null,"Inverter (if pump is DC)",null,null,{"$f":"E8","v":0},null,"Years"]
[null,null,"Control unit",null,null,{"$f":"E8","v":0},null,"Years"]
[null,"Initial Capital Costs","Pump",null,null,{"$f":"E8","v":0},null,"Years"]
[null,null,"Wires / tubes",null,null,{"$f":"IF($E$8=\"\",\"\",$E$8)","v":""},null,"Years"]
[null,null,"Water storage",null,null,"",null,"Years"]
[null,null,"Irrigation system",null,null,"",null,"Years"]
[null,null,"Drilling",null,null,""]
[null,null,"Installation",null,null,""]
[null,null,"Other costs",null,null,""]
[null,null,"Total costs",null,{"$f":"SUM(E61:E69)","v":0},""]
[]
[]
[{"$nulls":6},"Assumptions Grid Connection costs"]
[null,null,"Electricity costs per year:",null,{"$f":"J83","v":{"$error":"#DIV/0!"}},{"$f":"IF($E$8=\"\",\"\",$E$8)","v":""}]
[null,"Running costs","Maintenance costs per year:",null,null,{"$f":"IF($E$8=\"\",\"\",$E$8)","v":""},"Pump's power demand:",null,null,null,"kW"]
[null,null,"Operational costs per year:",null,null,{"$f":"IF($E$8=\"\",\"\",$E$8)","v":""},"Daily water requirement:",null,null,{"$f":"E20","v":0},"m³/day"]
[{"$nulls":6},"Volume flow m³/hour:",null,null,null,"m³/hour"]
[null,null,"Total costs per year:",null,{"$f":"SUM(E74:E76)","v":{"$error":"#DIV/0!"}},{"$f":"IF($E$8=\"\",\"\",$E$8)","v":""},"kWh needed per day: ",null,null,{"$f":"(J76/J77)*J75","v":{"$error":"#DIV/0!"}},"kWh"]
[{"$nulls":6},"Yearly irrigation days: ",null,null,null,"days/year"]
[{"$nulls":6},"kWh needed per year:",null,null,{"$f":"J79*J78","v":{"$error":"#DIV/0!"}},"kWh"]
[{"$nulls":6},"Cost kWh:",null,null,null,{"$f":"IF($E$8=\"\",\"\",$E$8) & \"/kWh\"","v":"/kWh"}]
[null,null,"Loan amount",null,null,{"$f":"IF($E$8=\"\",\"\",$E$8)","v":""},"Basic monthly connection fee",null,null,null,{"$f":"IF($E$8=\"\",\"\",$E$8) & \"/month\"","v":"/month"}]
[null,"Loan","Interest Rate",null,null,null,"Electricity cost per year:",null,null,{"$f":"(J81*J80)+(J82*12)","v":{"$error":"#DIV/0!"}},{"$f":"E8","v":0}]
[null,null,"Investment Period",null,null,"Years"]
[null,null,"Name of Bank"]
[]
[]
[]
[null,"Assumptions for: ",null,"Diesel powered irrigation system costs"]
[]
[]
[{"$nulls":6},"Component lifespan"]
[null,null,"Generator",null,null,{"$f":"IF($E$8=\"\",\"\",$E$8)","v":""},null,"Years"]
[null,"Initial Capital Costs","Pump",null,null,"",null,"Years"]
[null,null,"Wires / tubes",null,null,"",null,"Years"]
[null,null,"Water storage",null,null,"",null,"Years"]
[null,null,"Irrigation system",null,null,"",null,"Years",null,"CO2 - Emissions per year:"]
[null,null,"Drilling",null,null,"",null,null,"Diesel",{"$f":"VLOOKUP(I98,I100:J102,2,FALSE)*J111","v":{"$error":"#DIV/0!"}},"kg/year"]
[null,null,"Installation",null,null,"",null,null,"Emission factor:"]
[null,null,"Other costs",null,null,"",null,null,"Diesel",2.64,"kg of CO2/liter"]
[null,null,"Total costs",null,{"$f":"SUM(E91:E100)","v":0},"",null,null,"Petrol",2.39,"kg of CO2/liter"]
[{"$nulls":8},"LPG",1.67,"kg of CO2/liter"]
[]
[{"$nulls":6},"Assumptions Fuel Costs"]
[null,null,"Fuel costs per year:",null,{"$f":"J113","v":{"$error":"#DIV/0!"}},{"$f":"IF($E$8=\"\",\"\",$E$8)","v":""}]
[null,"Running costs","Maintenance costs per year:",null,null,{"$f":"IF($E$8=\"\",\"\",$E$8)","v":""},"Pump's fuel demand:",null,null,null,"l/hour"]
[null,null,"Operational costs per year:",null,null,{"$f":"IF($E$8=\"\",\"\",$E$8)","v":""},"Daily water requirement:",null,null,{"$f":"E20","v":0},"m³/day"]
[{"$nulls":6},"Volume flow m³/hour:",null,null,null,"m³/hour"]
[null,null,"Total costs per year:",null,{"$f":"SUM(E105:E107)","v":{"$error":"#DIV/0!"}},{"$f":"IF($E$8=\"\",\"\",$E$8)","v":""},"Fuel needed per day: ",null,null,{"$f":"(J107/J108)*J106","v":{"$error":"#DIV/0!"}},"l/day"]
[{"$nulls":6},"Yearly irrigation days: ",null,null,null,"days/year"]
[{"$nulls":6},"Fuel needed per year:",null,null,{"$f":"J110*J109","v":{"$error":"#DIV/0!"}},"l/year"]
[{"$nulls":6},"Cost Fuel",null,null,null,{"$f":"IF($E$8=\"\",\"\",$E$8) & \"/l\"","v":"/l"}]
[null,null,"Loan amount",null,null,{"$f":"IF($E$8=\"\",\"\",$E$8)","v":""},"Fuel cost per year:",null,null,{"$f":"J112*J111","v":{"$error":"#DIV/0!"}},{"$f":"IF($E$8=\"\",\"\",$E$8)","v":""}]
[null,"Loan","Interest Rate"]
[null,null,"Investment Period",null,null,"Years"]
[null,null,"Name of Bank"]

{"sheet":"Output","index":2,"n_rows":102,"n_cols":5,"rows_kept":102,"cut":false,"hidden":false,"merged":[[0,0,0,7],[98,1,100,5],[101,1,103,5]]}
["INVEST – Payback Tool"]
[]
["This OUTPUT sheet summarises the results as per the entries in the afore completed INPUT sheet."]
{"$rows_empty":20}
["Basic assumptions"]
[]
["Total water need per day",null,null,{"$f":"Input!E20 & \" m³ per day\"","v":" m³ per day"}]
[]
["Total income per year",null,null,{"$f":"TEXT(Input!E22,\"#.##0\") &\" \" & Input!E8","v":"0 "},"(in Year 1)"]
[]
["Total investment amount per year",null,null,{"$f":"TEXT(Input!E22,\"#.##0\")*Input!E24 &\" \" & Input!E8","v":"0 "},"(in Year 1)"]
[]
["Inflation",null,null,{"$f":"Input!E10","v":0}]
[]
["Discount rate",null,null,{"$f":"Input!E12","v":0}]
[]
["Annual profit margin increase",null,null,{"$f":"Input!E14","v":0}]
[]
["Annual fuel price increase",null,null,{"$f":"Input!E16","v":0}]
[]
[]
[]
[]
[]
[]
[{"$f":"\"Analysis for \" &Input!D28","v":"Analysis for Solar powered irrigation system costs"}]
[]
["Internal Rate of Return (IRR)",null,null,{"$f":"IFERROR('Cashflow Calculation'!C51,\"not feasible\")","v":"not feasible"}]
[]
["Net Present Value (NPV)",null,null,{"$f":"TEXT('Cashflow Calculation'!C50,\"#.##0\") & \" \" &Input!E8","v":"0 "}]
[]
["Accumulated cash flow after Year 25",null,null,{"$f":"TEXT('Cashflow Calculation'!S186,\"#.##0\") &\" \" &Input!E8","v":"0 "}]
[]
["System Life Cycle Costs (25 years)",null,null,{"$f":"TEXT('Cashflow Calculation'!B45,\"#.##0\") &\" \" &Input!E8","v":"0 "}]
[]
["Years for payback",null,null,{"$f":"'Cashflow Calculation'!B43","v":0}]
[]
["Lending Bank:",null,null,{"$f":"IF(Input!E53=0,\"\",Input!E53)","v":""}]
[]
["Yearly loan Repayment:",null,null,{"$f":"TEXT('Loan Repayment Solar'!Scheduled_Monthly_Payment,\"#.##0\") &\" \" &Input!E8","v":"0 "}]
[]
[]
[{"$f":"\"Analysis for \" &Input!D57","v":"Analysis for Grid powered irrigation system costs"}]
[]
["Internal Rate of Return (IRR)",null,null,{"$f":"IFERROR('Cashflow Calculation'!C89,\"not feasible\")","v":"not feasible"}]
[]
["Net Present Value (NPV)",null,null,{"$f":"TEXT('Cashflow Calculation'!C88,\"#.##0\") &\" \" &Input!E8","v":{"$error":"#DIV/0!"}}]
[]
["Accumulated cash flow after Year 25",null,null,{"$f":"TEXT('Cashflow Calculation'!S187,\"#.##0\") &\" \" &Input!E8","v":{"$error":"#DIV/0!"}}]
[]
["System Life Cycle Costs (25 years)",null,null,{"$f":"TEXT('Cashflow Calculation'!B83,\"#.##0\") &\" \" &Input!E8","v":{"$error":"#DIV/0!"}}]
[]
["Years for payback",null,null,{"$f":"'Cashflow Calculation'!B81","v":{"$error":"#DIV/0!"}}]
[]
["Lending Bank:",null,null,{"$f":"IF(Input!E85=0,\"\",Input!E85)","v":""}]
[]
["Yearly loan Repayment:",null,null,{"$f":"TEXT('Loan Repayment Grid'!Scheduled_Monthly_Payment,\"#.##0\") &\" \" &Input!E8","v":"0 "}]
[]
[]
[{"$f":"\"Analysis for \" &Input!D89","v":"Analysis for Diesel powered irrigation system costs"}]
[]
["Internal Rate of Return (IRR)",null,null,{"$f":"IFERROR('Cashflow Calculation'!C155,\"not feasible\")","v":"not feasible"}]
[]
["Net Present Value (NPV)",null,null,{"$f":"TEXT('Cashflow Calculation'!C154,\"#.##0\") &\" \" &Input!E8","v":{"$error":"#DIV/0!"}}]
[]
["Accumulated cash flow after Year 25",null,null,{"$f":"TEXT('Cashflow Calculation'!S188,\"#.##0\") &\" \" &Input!E8","v":{"$error":"#DIV/0!"}}]
[]
["System Life Cycle Costs (25years)",null,null,{"$f":"TEXT('Cashflow Calculation'!B149,\"#.##0\") &\" \" &Input!E8","v":{"$error":"#DIV/0!"}}]
[]
["Years for payback",null,null,{"$f":"'Cashflow Calculation'!B147","v":{"$error":"#DIV/0!"}}]
[]
["Lending Bank:",null,null,{"$f":"IF(Input!E116=0,\"\",Input!E116)","v":""}]
[]
["Yearly loan Repayment:",null,null,{"$f":"TEXT('Loan Repayment Diesel'!Scheduled_Monthly_Payment,\"#.##0\") &\" \" &Input!E8","v":"0 "}]
[]
[{"$f":"Input!J97","v":"CO2 - Emissions per year:"},null,null,{"$f":"Input!J98","v":{"$error":"#DIV/0!"}},{"$f":"Input!K98","v":"kg/year"}]
[]
[]
[]
["Note:","If \"not feasible\" is displayed for the Internal Rate of Return (IRR) then the IRR value is below 0%."]
[]
[]
[null,"If a negative (-) Net Present Value (NPV) is displayed then the investment is not feasible."]

{"sheet":"Cashflow Calculation","index":3,"n_rows":196,"n_cols":29,"rows_kept":196,"cut":false,"hidden":true,"merged":[[95,15,95,16],[96,13,96,14],[96,15,96,16],[153,1,154,1],[179,5,179,7],[49,1,50,1],[87,1,88,1],[95,13,95,14]]}
["Annual profit margin increase:",{"$f":"Input!E14","v":0}]
["Inflation rate:",{"$f":"Input!E10","v":0}]
["Income-Gross farm profit/year:",{"$f":"Input!E22","v":0},{"$f":"IF(Input!$E$8=\"\",\"\",Input!$E$8)","v":""}]
["Percentage profit to invest",{"$f":"Input!E24","v":0}]
["Fuel price increase/year: ",{"$f":"Input!E16","v":0}]
["Electricity price increase/year: ",{"$f":"Input!E18","v":0}]
["Discount rate",{"$f":"Input!E12","v":0}]
["Total water need per day",{"$f":"Input!E20","v":0},{"$f":"Input!F20","v":"m³ per day "}]
[]
[null,null,"year",0,1,2,3,4,5,6,7,8,9,10,11,12,13,14,15,16,17,18,19,20,21,22,23,24,25]
[null,null,{"$f":"IF(Input!$E$8=\"\",\"\",Input!$E$8)","v":""},0,{"$f":"B3*B4","v":0},{"$f":"E11*(1+(1*$B$1))","v":0},{"$f":"F11*(1+(1*$B$1))","v":0},{"$f":"G11*(1+(1*$B$1))","v":0},0,0,0,0,0,0,0,0,0,0,0,0,0,0,0,0,0,0,0,0,0]
["Capital investment per year:"]
[true,null,"accumulated",{"$f":"IF($A$13=TRUE,D14,NA())","v":0},{"$f":"IF($A$13=TRUE,E14,NA())","v":0},{"$f":"IF($A$13=TRUE,F14,NA())","v":0},0,0,0,0,0,0,0,0,0,0,0,0,0,0,0,0,0,0,0,0,0,0,0]
[null,null,null,0,{"$f":"SUM(E11)","v":0},{"$f":"SUM($E$11:F11)","v":0},{"$f":"SUM($E$11:G11)","v":0},{"$f":"SUM($E$11:H11)","v":0},{"$f":"SUM($E$11:I11)","v":0},{"$f":"SUM($E$11:J11)","v":0},{"$f":"SUM($E$11:K11)","v":0},{"$f":"SUM($E$11:L11)","v":0},{"$f":"SUM($E$11:M11)","v":0},{"$f":"SUM($E$11:N11)","v":0},{"$f":"SUM($E$11:O11)","v":0},{"$f":"SUM($E$11:P11)","v":0},{"$f":"SUM($E$11:Q11)","v":0},{"$f":"SUM($E$11:R11)","v":0},{"$f":"SUM($E$11:S11)","v":0},{"$f":"SUM($E$11:T11)","v":0},{"$f":"SUM($E$11:U11)","v":0},{"$f":"SUM($E$11:V11)","v":0},{"$f":"SUM($E$11:W11)","v":0},{"$f":"SUM($E$11:X11)","v":0},{"$f":"SUM($E$11:Y11)","v":0},{"$f":"SUM($E$11:Z11)","v":0},{"$f":"SUM($E$11:AA11)","v":0},{"$f":"SUM($E$11:AB11)","v":0},{"$f":"SUM($E$11:AC11)","v":0}]
[]
[]
[]
[]
[]
[{"$f":"Input!D28","v":"Solar powered irrigation system costs"}]
[]
[]
[{"$f":"Input!C32","v":"Solar panels"},null,{"$f":"IF(Input!$E$8=\"\",\"\",Input!$E$8)","v":""},{"$f":"Input!E32","v":0},{"$f":"IF(MOD(E10,Input!$G$32)=0,($D$23+E10*$B$2*$D$23),0)","v":{"$error":"#DIV/0!"}},{"$f":"IF(MOD(F10,Input!$G$32)=0,($D$23+F10*$B$2*$D$23),0)","v":{"$error":"#DIV/0!"}},{"$f":"IF(MOD(G10,Input!$G$32)=0,($D$23+G10*$B$2*$D$23),0)","v":{"$error":"#DIV/0!"}},{"$f":"IF(MOD(H10,Input!$G$32)=0,($D$23+H10*$B$2*$D$23),0)","v":{"$error":"#DIV/0!"}},{"$f":"IF(MOD(I10,Input!$G$32)=0,($D$23+I10*$B$2*$D$23),0)","v":{"$error":"#DIV/0!"}},{"$f":"IF(MOD(J10,Input!$G$32)=0,($D$23+J10*$B$2*$D$23),0)","v":{"$error":"#DIV/0!"}},{"$f":"IF(MOD(K10,Input!$G$32)=0,($D$23+K10*$B$2*$D$23),0)","v":{"$error":"#DIV/0!"}},{"$f":"IF(MOD(L10,Input!$G$32)=0,($D$23+L10*$B$2*$D$23),0)","v":{"$error":"#DIV/0!"}},{"$f":"IF(MOD(M10,Input!$G$32)=0,($D$23+M10*$B$2*$D$23),0)","v":{"$error":"#DIV/0!"}},{"$f":"IF(MOD(N10,Input!$G$32)=0,($D$23+N10*$B$2*$D$23),0)","v":{"$error":"#DIV/0!"}},{"$f":"IF(MOD(O10,Input!$G$32)=0,($D$23+O10*$B$2*$D$23),0)","v":{"$error":"#DIV/0!"}},{"$f":"IF(MOD(P10,Input!$G$32)=0,($D$23+P10*$B$2*$D$23),0)","v":{"$error":"#DIV/0!"}},{"$f":"IF(MOD(Q10,Input!$G$32)=0,($D$23+Q10*$B$2*$D$23),0)","v":{"$error":"#DIV/0!"}},{"$f":"IF(MOD(R10,Input!$G$32)=0,($D$23+R10*$B$2*$D$23),0)","v":{"$error":"#DIV/0!"}},{"$f":"IF(MOD(S10,Input!$G$32)=0,($D$23+S10*$B$2*$D$23),0)","v":{"$error":"#DIV/0!"}},{"$f":"IF(MOD(T10,Input!$G$32)=0,($D$23+T10*$B$2*$D$23),0)","v":{"$error":"#DIV/0!"}},{"$f":"IF(MOD(U10,Input!$G$32)=0,($D$23+U10*$B$2*$D$23),0)","v":{"$error":"#DIV/0!"}},{"$f":"IF(MOD(V10,Input!$G$32)=0,($D$23+V10*$B$2*$D$23),0)","v":{"$error":"#DIV/0!"}},{"$f":"IF(MOD(W10,Input!$G$32)=0,($D$23+W10*$B$2*$D$23),0)","v":{"$error":"#DIV/0!"}},{"$f":"IF(MOD(X10,Input!$G$32)=0,($D$23+X10*$B$2*$D$23),0)","v":{"$error":"#DIV/0!"}},{"$f":"IF(MOD(Y10,Input!$G$32)=0,($D$23+Y10*$B$2*$D$23),0)","v":{"$error":"#DIV/0!"}},{"$f":"IF(MOD(Z10,Input!$G$32)=0,($D$23+Z10*$B$2*$D$23),0)","v":{"$error":"#DIV/0!"}},{"$f":"IF(MOD(AA10,Input!$G$32)=0,($D$23+AA10*$B$2*$D$23),0)","v":{"$error":"#DIV/0!"}},{"$f":"IF(MOD(AB10,Input!$G$32)=0,($D$23+AB10*$B$2*$D$23),0)","v":{"$error":"#DIV/0!"}},{"$f":"IF(MOD(AC10,Input!$G$32)=0,($D$23+AC10*$B$2*$D$23),0)","v":{"$error":"#DIV/0!"}}]
[{"$f":"Input!C33","v":"Control unit"},null,{"$f":"IF(Input!$E$8=\"\",\"\",Input!$E$8)","v":""},{"$f":"Input!E33","v":0},{"$f":"IF(MOD(E10,Input!$G$33)=0,($D$24+E10*$B$2*$D$24),0)","v":{"$error":"#DIV/0!"}},{"$f":"IF(MOD(F10,Input!$G$33)=0,($D$24+F10*$B$2*$D$24),0)","v":{"$error":"#DIV/0!"}},{"$f":"IF(MOD(G10,Input!$G$33)=0,($D$24+G10*$B$2*$D$24),0)","v":{"$error":"#DIV/0!"}},{"$f":"IF(MOD(H10,Input!$G$33)=0,($D$24+H10*$B$2*$D$24),0)","v":{"$error":"#DIV/0!"}},{"$f":"IF(MOD(I10,Input!$G$33)=0,($D$24+I10*$B$2*$D$24),0)","v":{"$error":"#DIV/0!"}},{"$f":"IF(MOD(J10,Input!$G$33)=0,($D$24+J10*$B$2*$D$24),0)","v":{"$error":"#DIV/0!"}},{"$f":"IF(MOD(K10,Input!$G$33)=0,($D$24+K10*$B$2*$D$24),0)","v":{"$error":"#DIV/0!"}},{"$f":"IF(MOD(L10,Input!$G$33)=0,($D$24+L10*$B$2*$D$24),0)","v":{"$error":"#DIV/0!"}},{"$f":"IF(MOD(M10,Input!$G$33)=0,($D$24+M10*$B$2*$D$24),0)","v":{"$error":"#DIV/0!"}},{"$f":"IF(MOD(N10,Input!$G$33)=0,($D$24+N10*$B$2*$D$24),0)","v":{"$error":"#DIV/0!"}},{"$f":"IF(MOD(O10,Input!$G$33)=0,($D$24+O10*$B$2*$D$24),0)","v":{"$error":"#DIV/0!"}},{"$f":"IF(MOD(P10,Input!$G$33)=0,($D$24+P10*$B$2*$D$24),0)","v":{"$error":"#DIV/0!"}},{"$f":"IF(MOD(Q10,Input!$G$33)=0,($D$24+Q10*$B$2*$D$24),0)","v":{"$error":"#DIV/0!"}},{"$f":"IF(MOD(R10,Input!$G$33)=0,($D$24+R10*$B$2*$D$24),0)","v":{"$error":"#DIV/0!"}},{"$f":"IF(MOD(S10,Input!$G$33)=0,($D$24+S10*$B$2*$D$24),0)","v":{"$error":"#DIV/0!"}},{"$f":"IF(MOD(T10,Input!$G$33)=0,($D$24+T10*$B$2*$D$24),0)","v":{"$error":"#DIV/0!"}},{"$f":"IF(MOD(U10,Input!$G$33)=0,($D$24+U10*$B$2*$D$24),0)","v":{"$error":"#DIV/0!"}},{"$f":"IF(MOD(V10,Input!$G$33)=0,($D$24+V10*$B$2*$D$24),0)","v":{"$error":"#DIV/0!"}},{"$f":"IF(MOD(W10,Input!$G$33)=0,($D$24+W10*$B$2*$D$24),0)","v":{"$error":"#DIV/0!"}},{"$f":"IF(MOD(X10,Input!$G$33)=0,($D$24+X10*$B$2*$D$24),0)","v":{"$error":"#DIV/0!"}},{"$f":"IF(MOD(Y10,Input!$G$33)=0,($D$24+Y10*$B$2*$D$24),0)","v":{"$error":"#DIV/0!"}},{"$f":"IF(MOD(Z10,Input!$G$33)=0,($D$24+Z10*$B$2*$D$24),0)","v":{"$error":"#DIV/0!"}},{"$f":"IF(MOD(AA10,Input!$G$33)=0,($D$24+AA10*$B$2*$D$24),0)","v":{"$error":"#DIV/0!"}},{"$f":"IF(MOD(AB10,Input!$G$33)=0,($D$24+AB10*$B$2*$D$24),0)","v":{"$error":"#DIV/0!"}},{"$f":"IF(MOD(AC10,Input!$G$33)=0,($D$24+AC10*$B$2*$D$24),0)","v":{"$error":"#DIV/0!"}}]
[{"$f":"Input!C34","v":"Pump"},null,{"$f":"IF(Input!$E$8=\"\",\"\",Input!$E$8)","v":""},{"$f":"Input!E34","v":0},{"$f":"IF(MOD(E10,Input!$G$34)=0,($D$25+E10*$B$2*$D$25),0)","v":{"$error":"#DIV/0!"}},{"$f":"IF(MOD(F10,Input!$G$34)=0,($D$25+F10*$B$2*$D$25),0)","v":{"$error":"#DIV/0!"}},{"$f":"IF(MOD(G10,Input!$G$34)=0,($D$25+G10*$B$2*$D$25),0)","v":{"$error":"#DIV/0!"}},{"$f":"IF(MOD(H10,Input!$G$34)=0,($D$25+H10*$B$2*$D$25),0)","v":{"$error":"#DIV/0!"}},{"$f":"IF(MOD(I10,Input!$G$34)=0,($D$25+I10*$B$2*$D$25),0)","v":{"$error":"#DIV/0!"}},{"$f":"IF(MOD(J10,Input!$G$34)=0,($D$25+J10*$B$2*$D$25),0)","v":{"$error":"#DIV/0!"}},{"$f":"IF(MOD(K10,Input!$G$34)=0,($D$25+K10*$B$2*$D$25),0)","v":{"$error":"#DIV/0!"}},{"$f":"IF(MOD(L10,Input!$G$34)=0,($D$25+L10*$B$2*$D$25),0)","v":{"$error":"#DIV/0!"}},{"$f":"IF(MOD(M10,Input!$G$34)=0,($D$25+M10*$B$2*$D$25),0)","v":{"$error":"#DIV/0!"}},{"$f":"IF(MOD(N10,Input!$G$34)=0,($D$25+N10*$B$2*$D$25),0)","v":{"$error":"#DIV/0!"}},{"$f":"IF(MOD(O10,Input!$G$34)=0,($D$25+O10*$B$2*$D$25),0)","v":{"$error":"#DIV/0!"}},{"$f":"IF(MOD(P10,Input!$G$34)=0,($D$25+P10*$B$2*$D$25),0)","v":{"$error":"#DIV/0!"}},{"$f":"IF(MOD(Q10,Input!$G$34)=0,($D$25+Q10*$B$2*$D$25),0)","v":{"$error":"#DIV/0!"}},{"$f":"IF(MOD(R10,Input!$G$34)=0,($D$25+R10*$B$2*$D$25),0)","v":{"$error":"#DIV/0!"}},{"$f":"IF(MOD(S10,Input!$G$34)=0,($D$25+S10*$B$2*$D$25),0)","v":{"$error":"#DIV/0!"}},{"$f":"IF(MOD(T10,Input!$G$34)=0,($D$25+T10*$B$2*$D$25),0)","v":{"$error":"#DIV/0!"}},{"$f":"IF(MOD(U10,Input!$G$34)=0,($D$25+U10*$B$2*$D$25),0)","v":{"$error":"#DIV/0!"}},{"$f":"IF(MOD(V10,Input!$G$34)=0,($D$25+V10*$B$2*$D$25),0)","v":{"$error":"#DIV/0!"}},{"$f":"IF(MOD(W10,Input!$G$34)=0,($D$25+W10*$B$2*$D$25),0)","v":{"$error":"#DIV/0!"}},{"$f":"IF(MOD(X10,Input!$G$34)=0,($D$25+X10*$B$2*$D$25),0)","v":{"$error":"#DIV/0!"}},{"$f":"IF(MOD(Y10,Input!$G$34)=0,($D$25+Y10*$B$2*$D$25),0)","v":{"$error":"#DIV/0!"}},{"$f":"IF(MOD(Z10,Input!$G$34)=0,($D$25+Z10*$B$2*$D$25),0)","v":{"$error":"#DIV/0!"}},{"$f":"IF(MOD(AA10,Input!$G$34)=0,($D$25+AA10*$B$2*$D$25),0)","v":{"$error":"#DIV/0!"}},{"$f":"IF(MOD(AB10,Input!$G$34)=0,($D$25+AB10*$B$2*$D$25),0)","v":{"$error":"#DIV/0!"}},{"$f":"IF(MOD(AC10,Input!$G$34)=0,($D$25+AC10*$B$2*$D$25),0)","v":{"$error":"#DIV/0!"}}]
["Wires / tubes",null,{"$f":"IF(Input!$E$8=\"\",\"\",Input!$E$8)","v":""},{"$f":"Input!E35","v":0},{"$f":"IF(MOD(E10,Input!$G$35)=0,($D$26+E10*$B$2*$D$26),0)","v":{"$error":"#DIV/0!"}},{"$f":"IF(MOD(F10,Input!$G$35)=0,($D$26+F10*$B$2*$D$26),0)","v":{"$error":"#DIV/0!"}},{"$f":"IF(MOD(G10,Input!$G$35)=0,($D$26+G10*$B$2*$D$26),0)","v":{"$error":"#DIV/0!"}},{"$f":"IF(MOD(H10,Input!$G$35)=0,($D$26+H10*$B$2*$D$26),0)","v":{"$error":"#DIV/0!"}},{"$f":"IF(MOD(I10,Input!$G$35)=0,($D$26+I10*$B$2*$D$26),0)","v":{"$error":"#DIV/0!"}},{"$f":"IF(MOD(J10,Input!$G$35)=0,($D$26+J10*$B$2*$D$26),0)","v":{"$error":"#DIV/0!"}},{"$f":"IF(MOD(K10,Input!$G$35)=0,($D$26+K10*$B$2*$D$26),0)","v":{"$error":"#DIV/0!"}},{"$f":"IF(MOD(L10,Input!$G$35)=0,($D$26+L10*$B$2*$D$26),0)","v":{"$error":"#DIV/0!"}},{"$f":"IF(MOD(M10,Input!$G$35)=0,($D$26+M10*$B$2*$D$26),0)","v":{"$error":"#DIV/0!"}},{"$f":"IF(MOD(N10,Input!$G$35)=0,($D$26+N10*$B$2*$D$26),0)","v":{"$error":"#DIV/0!"}},{"$f":"IF(MOD(O10,Input!$G$35)=0,($D$26+O10*$B$2*$D$26),0)","v":{"$error":"#DIV/0!"}},{"$f":"IF(MOD(P10,Input!$G$35)=0,($D$26+P10*$B$2*$D$26),0)","v":{"$error":"#DIV/0!"}},{"$f":"IF(MOD(Q10,Input!$G$35)=0,($D$26+Q10*$B$2*$D$26),0)","v":{"$error":"#DIV/0!"}},{"$f":"IF(MOD(R10,Input!$G$35)=0,($D$26+R10*$B$2*$D$26),0)","v":{"$error":"#DIV/0!"}},{"$f":"IF(MOD(S10,Input!$G$35)=0,($D$26+S10*$B$2*$D$26),0)","v":{"$error":"#DIV/0!"}},{"$f":"IF(MOD(T10,Input!$G$35)=0,($D$26+T10*$B$2*$D$26),0)","v":{"$error":"#DIV/0!"}},{"$f":"IF(MOD(U10,Input!$G$35)=0,($D$26+U10*$B$2*$D$26),0)","v":{"$error":"#DIV/0!"}},{"$f":"IF(MOD(V10,Input!$G$35)=0,($D$26+V10*$B$2*$D$26),0)","v":{"$error":"#DIV/0!"}},{"$f":"IF(MOD(W10,Input!$G$35)=0,($D$26+W10*$B$2*$D$26),0)","v":{"$error":"#DIV/0!"}},{"$f":"IF(MOD(X10,Input!$G$35)=0,($D$26+X10*$B$2*$D$26),0)","v":{"$error":"#DIV/0!"}},{"$f":"IF(MOD(Y10,Input!$G$35)=0,($D$26+Y10*$B$2*$D$26),0)","v":{"$error":"#DIV/0!"}},{"$f":"IF(MOD(Z10,Input!$G$35)=0,($D$26+Z10*$B$2*$D$26),0)","v":{"$error":"#DIV/0!"}},{"$f":"IF(MOD(AA10,Input!$G$35)=0,($D$26+AA10*$B$2*$D$26),0)","v":{"$error":"#DIV/0!"}},{"$f":"IF(MOD(AB10,Input!$G$35)=0,($D$26+AB10*$B$2*$D$26),0)","v":{"$error":"#DIV/0!"}},{"$f":"IF(MOD(AC10,Input!$G$35)=0,($D$26+AC10*$B$2*$D$26),0)","v":{"$error":"#DIV/0!"}}]
["Water storage",null,{"$f":"IF(Input!$E$8=\"\",\"\",Input!$E$8)","v":""},{"$f":"Input!E36","v":0},{"$f":"IF(MOD(E10,Input!$G$36)=0,($D$27+E10*$B$2*$D$27),0)","v":{"$error":"#DIV/0!"}},{"$f":"IF(MOD(F10,Input!$G$36)=0,($D$27+F10*$B$2*$D$27),0)","v":{"$error":"#DIV/0!"}},{"$f":"IF(MOD(G10,Input!$G$36)=0,($D$27+G10*$B$2*$D$27),0)","v":{"$error":"#DIV/0!"}},{"$f":"IF(MOD(H10,Input!$G$36)=0,($D$27+H10*$B$2*$D$27),0)","v":{"$error":"#DIV/0!"}},{"$f":"IF(MOD(I10,Input!$G$36)=0,($D$27+I10*$B$2*$D$27),0)","v":{"$error":"#DIV/0!"}},{"$f":"IF(MOD(J10,Input!$G$36)=0,($D$27+J10*$B$2*$D$27),0)","v":{"$error":"#DIV/0!"}},{"$f":"IF(MOD(K10,Input!$G$36)=0,($D$27+K10*$B$2*$D$27),0)","v":{"$error":"#DIV/0!"}},{"$f":"IF(MOD(L10,Input!$G$36)=0,($D$27+L10*$B$2*$D$27),0)","v":{"$error":"#DIV/0!"}},{"$f":"IF(MOD(M10,Input!$G$36)=0,($D$27+M10*$B$2*$D$27),0)","v":{"$error":"#DIV/0!"}},{"$f":"IF(MOD(N10,Input!$G$36)=0,($D$27+N10*$B$2*$D$27),0)","v":{"$error":"#DIV/0!"}},{"$f":"IF(MOD(O10,Input!$G$36)=0,($D$27+O10*$B$2*$D$27),0)","v":{"$error":"#DIV/0!"}},{"$f":"IF(MOD(P10,Input!$G$36)=0,($D$27+P10*$B$2*$D$27),0)","v":{"$error":"#DIV/0!"}},{"$f":"IF(MOD(Q10,Input!$G$36)=0,($D$27+Q10*$B$2*$D$27),0)","v":{"$error":"#DIV/0!"}},{"$f":"IF(MOD(R10,Input!$G$36)=0,($D$27+R10*$B$2*$D$27),0)","v":{"$error":"#DIV/0!"}},{"$f":"IF(MOD(S10,Input!$G$36)=0,($D$27+S10*$B$2*$D$27),0)","v":{"$error":"#DIV/0!"}},{"$f":"IF(MOD(T10,Input!$G$36)=0,($D$27+T10*$B$2*$D$27),0)","v":{"$error":"#DIV/0!"}},{"$f":"IF(MOD(U10,Input!$G$36)=0,($D$27+U10*$B$2*$D$27),0)","v":{"$error":"#DIV/0!"}},{"$f":"IF(MOD(V10,Input!$G$36)=0,($D$27+V10*$B$2*$D$27),0)","v":{"$error":"#DIV/0!"}},{"$f":"IF(MOD(W10,Input!$G$36)=0,($D$27+W10*$B$2*$D$27),0)","v":{"$error":"#DIV/0!"}},{"$f":"IF(MOD(X10,Input!$G$36)=0,($D$27+X10*$B$2*$D$27),0)","v":{"$error":"#DIV/0!"}},{"$f":"IF(MOD(Y10,Input!$G$36)=0,($D$27+Y10*$B$2*$D$27),0)","v":{"$error":"#DIV/0!"}},{"$f":"IF(MOD(Z10,Input!$G$36)=0,($D$27+Z10*$B$2*$D$27),0)","v":{"$error":"#DIV/0!"}},{"$f":"IF(MOD(AA10,Input!$G$36)=0,($D$27+AA10*$B$2*$D$27),0)","v":{"$error":"#DIV/0!"}},{"$f":"IF(MOD(AB10,Input!$G$36)=0,($D$27+AB10*$B$2*$D$27),0)","v":{"$error":"#DIV/0!"}},{"$f":"IF(MOD(AC10,Input!$G$36)=0,($D$27+AC10*$B$2*$D$27),0)","v":{"$error":"#DIV/0!"}}]
["Irrigation system",null,{"$f":"IF(Input!$E$8=\"\",\"\",Input!$E$8)","v":""},{"$f":"Input!E37","v":0},{"$f":"IF(MOD(E10,Input!$G$37)=0,($D$28+E10*$B$2*$D$28),0)","v":{"$error":"#DIV/0!"}},{"$f":"IF(MOD(F10,Input!$G$37)=0,($D$28+F10*$B$2*$D$28),0)","v":{"$error":"#DIV/0!"}},{"$f":"IF(MOD(G10,Input!$G$37)=0,($D$28+G10*$B$2*$D$28),0)","v":{"$error":"#DIV/0!"}},{"$f":"IF(MOD(H10,Input!$G$37)=0,($D$28+H10*$B$2*$D$28),0)","v":{"$error":"#DIV/0!"}},{"$f":"IF(MOD(I10,Input!$G$37)=0,($D$28+I10*$B$2*$D$28),0)","v":{"$error":"#DIV/0!"}},{"$f":"IF(MOD(J10,Input!$G$37)=0,($D$28+J10*$B$2*$D$28),0)","v":{"$error":"#DIV/0!"}},{"$f":"IF(MOD(K10,Input!$G$37)=0,($D$28+K10*$B$2*$D$28),0)","v":{"$error":"#DIV/0!"}},{"$f":"IF(MOD(L10,Input!$G$37)=0,($D$28+L10*$B$2*$D$28),0)","v":{"$error":"#DIV/0!"}},{"$f":"IF(MOD(M10,Input!$G$37)=0,($D$28+M10*$B$2*$D$28),0)","v":{"$error":"#DIV/0!"}},{"$f":"IF(MOD(N10,Input!$G$37)=0,($D$28+N10*$B$2*$D$28),0)","v":{"$error":"#DIV/0!"}},{"$f":"IF(MOD(O10,Input!$G$37)=0,($D$28+O10*$B$2*$D$28),0)","v":{"$error":"#DIV/0!"}},{"$f":"IF(MOD(P10,Input!$G$37)=0,($D$28+P10*$B$2*$D$28),0)","v":{"$error":"#DIV/0!"}},{"$f":"IF(MOD(Q10,Input!$G$37)=0,($D$28+Q10*$B$2*$D$28),0)","v":{"$error":"#DIV/0!"}},{"$f":"IF(MOD(R10,Input!$G$37)=0,($D$28+R10*$B$2*$D$28),0)","v":{"$error":"#DIV/0!"}},{"$f":"IF(MOD(S10,Input!$G$37)=0,($D$28+S10*$B$2*$D$28),0)","v":{"$error":"#DIV/0!"}},{"$f":"IF(MOD(T10,Input!$G$37)=0,($D$28+T10*$B$2*$D$28),0)","v":{"$error":"#DIV/0!"}},{"$f":"IF(MOD(U10,Input!$G$37)=0,($D$28+U10*$B$2*$D$28),0)","v":{"$error":"#DIV/0!"}},{"$f":"IF(MOD(V10,Input!$G$37)=0,($D$28+V10*$B$2*$D$28),0)","v":{"$error":"#DIV/0!"}},{"$f":"IF(MOD(W10,Input!$G$37)=0,($D$28+W10*$B$2*$D$28),0)","v":{"$error":"#DIV/0!"}},{"$f":"IF(MOD(X10,Input!$G$37)=0,($D$28+X10*$B$2*$D$28),0)","v":{"$error":"#DIV/0!"}},{"$f":"IF(MOD(Y10,Input!$G$37)=0,($D$28+Y10*$B$2*$D$28),0)","v":{"$error":"#DIV/0!"}},{"$f":"IF(MOD(Z10,Input!$G$37)=0,($D$28+Z10*$B$2*$D$28),0)","v":{"$error":"#DIV/0!"}},{"$f":"IF(MOD(AA10,Input!$G$37)=0,($D$28+AA10*$B$2*$D$28),0)","v":{"$error":"#DIV/0!"}},{"$f":"IF(MOD(AB10,Input!$G$37)=0,($D$28+AB10*$B$2*$D$28),0)","v":{"$error":"#DIV/0!"}},{"$f":"IF(MOD(AC10,Input!$G$37)=0,($D$28+AC10*$B$2*$D$28),0)","v":{"$error":"#DIV/0!"}}]
["Drilling",null,{"$f":"IF(Input!$E$8=\"\",\"\",Input!$E$8)","v":""},{"$f":"Input!E38","v":0}]
["Installation",null,{"$f":"IF(Input!$E$8=\"\",\"\",Input!$E$8)","v":""},{"$f":"Input!E39","v":0}]
["Other Costs",null,{"$f":"IF(Input!$E$8=\"\",\"\",Input!$E$8)","v":""},{"$f":"Input!E40","v":0}]
["Loan Repayment ",null,{"$f":"IF(Input!$E$8=\"\",\"\",Input!$E$8)","v":""},0,{"$f":"IF(E10<='Loan Repayment Solar'!Loan_Years,'Loan Repayment Solar'!Scheduled_Monthly_Payment,0)","v":0},{"$f":"IF(F10<='Loan Repayment Solar'!Loan_Years,'Loan Repayment Solar'!Scheduled_Monthly_Payment,0)","v":0},{"$f":"IF(G10<='Loan Repayment Solar'!Loan_Years,'Loan Repayment Solar'!Scheduled_Monthly_Payment,0)","v":0},{"$f":"IF(H10<='Loan Repayment Solar'!Loan_Years,'Loan Repayment Solar'!Scheduled_Monthly_Payment,0)","v":0},{"$f":"IF(I10<='Loan Repayment Solar'!Loan_Years,'Loan Repayment Solar'!Scheduled_Monthly_Payment,0)","v":0},{"$f":"IF(J10<='Loan Repayment Solar'!Loan_Years,'Loan Repayment Solar'!Scheduled_Monthly_Payment,0)","v":0},{"$f":"IF(K10<='Loan Repayment Solar'!Loan_Years,'Loan Repayment Solar'!Scheduled_Monthly_Payment,0)","v":0},{"$f":"IF(L10<='Loan Repayment Solar'!Loan_Years,'Loan Repayment Solar'!Scheduled_Monthly_Payment,0)","v":0},{"$f":"IF(M10<='Loan Repayment Solar'!Loan_Years,'Loan Repayment Solar'!Scheduled_Monthly_Payment,0)","v":0},{"$f":"IF(N10<='Loan Repayment Solar'!Loan_Years,'Loan Repayment Solar'!Scheduled_Monthly_Payment,0)","v":0},{"$f":"IF(O10<='Loan Repayment Solar'!Loan_Years,'Loan Repayment Solar'!Scheduled_Monthly_Payment,0)","v":0},{"$f":"IF(P10<='Loan Repayment Solar'!Loan_Years,'Loan Repayment Solar'!Scheduled_Monthly_Payment,0)","v":0},{"$f":"IF(Q10<='Loan Repayment Solar'!Loan_Years,'Loan Repayment Solar'!Scheduled_Monthly_Payment,0)","v":0},{"$f":"IF(R10<='Loan Repayment Solar'!Loan_Years,'Loan Repayment Solar'!Scheduled_Monthly_Payment,0)","v":0},{"$f":"IF(S10<='Loan Repayment Solar'!Loan_Years,'Loan Repayment Solar'!Scheduled_Monthly_Payment,0)","v":0},{"$f":"IF(T10<='Loan Repayment Solar'!Loan_Years,'Loan Repayment Solar'!Scheduled_Monthly_Payment,0)","v":0},{"$f":"IF(U10<='Loan Repayment Solar'!Loan_Years,'Loan Repayment Solar'!Scheduled_Monthly_Payment,0)","v":0},{"$f":"IF(V10<='Loan Repayment Solar'!Loan_Years,'Loan Repayment Solar'!Scheduled_Monthly_Payment,0)","v":0},{"$f":"IF(W10<='Loan Repayment Solar'!Loan_Years,'Loan Repayment Solar'!Scheduled_Monthly_Payment,0)","v":0},{"$f":"IF(X10<='Loan Repayment Solar'!Loan_Years,'Loan Repayment Solar'!Scheduled_Monthly_Payment,0)","v":0},{"$f":"IF(Y10<='Loan Repayment Solar'!Loan_Years,'Loan Repayment Solar'!Scheduled_Monthly_Payment,0)","v":0},{"$f":"IF(Z10<='Loan Repayment Solar'!Loan_Years,'Loan Repayment Solar'!Scheduled_Monthly_Payment,0)","v":0},{"$f":"IF(AA10<='Loan Repayment Solar'!Loan_Years,'Loan Repayment Solar'!Scheduled_Monthly_Payment,0)","v":0},{"$f":"IF(AB10<='Loan Repayment Solar'!Loan_Years,'Loan Repayment Solar'!Scheduled_Monthly_Payment,0)","v":0},{"$f":"IF(AC10<='Loan Repayment Solar'!Loan_Years,'Loan Repayment Solar'!Scheduled_Monthly_Payment,0)","v":0}]
["Energy costs (fuel or electricity):",null,{"$f":"IF(Input!$E$8=\"\",\"\",Input!$E$8)","v":""},0,{"$f":"Input!E43","v":0},{"$f":"E33*(1+(1*$B$5))","v":0},{"$f":"F33*(1+(1*$B$5))","v":0},0,0,0,0,0,0,0,0,0,0,0,0,0,0,0,0,0,0,0,0,0,0]
["Operating Costs:",null,{"$f":"IF(Input!$E$8=\"\",\"\",Input!$E$8)","v":""},0,{"$f":"SUM(Input!E44:E45)","v":0},{"$f":"E34*(1+(1*$B$2))","v":0},0,0,0,0,0,0,0,0,0,0,0,0,0,0,0,0,0,0,0,0,0,0,0]
[]
[]
["Gross Expenses System per year:",null,{"$f":"IF(Input!$E$8=\"\",\"\",Input!$E$8)","v":""},{"$f":"SUM(D23:D31)","v":0},{"$f":"E33+E34+SUMIF(E23:E32,\"<1E+307\")","v":0},{"$f":"F33+F34+SUMIF(F23:F32,\"<1E+307\")","v":0},0,0,0,0,0,0,0,0,0,0,0,0,0,0,0,0,0,0,0,0,0,0,0]
[]
[]
["Cash Flow:",null,null,{"$f":"D13-D45","v":0},{"$f":"E13-E45","v":0},{"$f":"F13-F45","v":0},{"$f":"G13-G45","v":0},0,0,0,0,0,0,0,0,0,0,0,0,0,0,0,0,0,0,0,0,0,0]
[]
[null,null,null,{"$f":"IF(D40>0,\"Yes\",\"No\")","v":"No"},{"$f":"IF(E40>0,\"Yes\",\"No\")","v":"No"},{"$f":"IF(F40>0,\"Yes\",\"No\")","v":"No"},"No","No","No","No","No","No","No","No","No","No","No","No","No","No","No","No","No","No","No","No","No","No","No"]
["Payback period against investment (years)",{"$f":"IF(AC40<0,\"no payback\",COUNTIF(D40:AC40,\"<0\"))","v":0},"years"]
[]
["System Life Cycle Costs (25 years)",{"$f":"AC46","v":0},{"$f":"IF(Input!$E$8=\"\",\"\",Input!$E$8)","v":""},{"$f":"IF($A$46=TRUE,D46,NA())","v":0},{"$f":"IF($A$46=TRUE,E46,NA())","v":0},0,0,0,0,0,0,0,0,0,0,0,0,0,0,0,0,0,0,0,0,0,0,0,0]
[true,null,null,{"$f":"D37","v":0},{"$f":"SUM($D$37:E37)","v":0},{"$f":"SUM($D$37:F37)","v":0},{"$f":"SUM($D$37:G37)","v":0},{"$f":"SUM($D$37:H37)","v":0},{"$f":"SUM($D$37:I37)","v":0},{"$f":"SUM($D$37:J37)","v":0},{"$f":"SUM($D$37:K37)","v":0},{"$f":"SUM($D$37:L37)","v":0},{"$f":"SUM($D$37:M37)","v":0},{"$f":"SUM($D$37:N37)","v":0},{"$f":"SUM($D$37:O37)","v":0},{"$f":"SUM($D$37:P37)","v":0},{"$f":"SUM($D$37:Q37)","v":0},{"$f":"SUM($D$37:R37)","v":0},{"$f":"SUM($D$37:S37)","v":0},{"$f":"SUM($D$37:T37)","v":0},{"$f":"SUM($D$37:U37)","v":0},{"$f":"SUM($D$37:V37)","v":0},{"$f":"SUM($D$37:W37)","v":0},{"$f":"SUM($D$37:X37)","v":0},{"$f":"SUM($D$37:Y37)","v":0},{"$f":"SUM($D$37:Z37)","v":0},{"$f":"SUM($D$37:AA37)","v":0},{"$f":"SUM($D$37:AB37)","v":0},{"$f":"SUM($D$37:AC37)","v":0}]
["Cost per water (m3)",null,null,{"$f":"D37/($B$8*365)","v":{"$error":"#DIV/0!"}},{"$f":"E37/($B$8*365)","v":{"$error":"#DIV/0!"}},{"$error":"#DIV/0!"},{"$error":"#DIV/0!"},{"$error":"#DIV/0!"},{"$error":"#DIV/0!"},{"$error":"#DIV/0!"},{"$error":"#DIV/0!"},{"$error":"#DIV/0!"},{"$error":"#DIV/0!"},{"$error":"#DIV/0!"},{"$error":"#DIV/0!"},{"$error":"#DIV/0!"},{"$error":"#DIV/0!"},{"$error":"#DIV/0!"},{"$error":"#DIV/0!"},{"$error":"#DIV/0!"},{"$error":"#DIV/0!"},{"$error":"#DIV/0!"},{"$error":"#DIV/0!"},{"$error":"#DIV/0!"},{"$error":"#DIV/0!"},{"$error":"#DIV/0!"},{"$error":"#DIV/0!"},{"$error":"#DIV/0!"},{"$error":"#DIV/0!"}]
[]
[]
["NPV",{"$f":"Input!E12","v":0},{"$f":"NPV(B50,E40:X40)+D40","v":0}]
["IRR",null,{"$f":"IRR(D40:X40)","v":{"$error":"#NUM!"}}]
[]
[]
[]
[]
[]
[]
[{"$f":"Input!D57","v":"Grid powered irrigation system costs"}]
[]
[]
[{"$f":"Input!C61","v":"Inverter (if pump is DC)"},null,{"$f":"IF(Input!$E$8=\"\",\"\",Input!$E$8)","v":""},{"$f":"Input!E61","v":0},{"$f":"IF(MOD(E10,Input!$G$61)=0,($D$61+E10*$B$2*$D$61),0)","v":{"$error":"#DIV/0!"}},{"$f":"IF(MOD(F10,Input!$G$61)=0,($D$61+F10*$B$2*$D$61),0)","v":{"$error":"#DIV/0!"}},{"$f":"IF(MOD(G10,Input!$G$61)=0,($D$61+G10*$B$2*$D$61),0)","v":{"$error":"#DIV/0!"}},{"$f":"IF(MOD(H10,Input!$G$61)=0,($D$61+H10*$B$2*$D$61),0)","v":{"$error":"#DIV/0!"}},{"$f":"IF(MOD(I10,Input!$G$61)=0,($D$61+I10*$B$2*$D$61),0)","v":{"$error":"#DIV/0!"}},{"$f":"IF(MOD(J10,Input!$G$61)=0,($D$61+J10*$B$2*$D$61),0)","v":{"$error":"#DIV/0!"}},{"$f":"IF(MOD(K10,Input!$G$61)=0,($D$61+K10*$B$2*$D$61),0)","v":{"$error":"#DIV/0!"}},{"$f":"IF(MOD(L10,Input!$G$61)=0,($D$61+L10*$B$2*$D$61),0)","v":{"$error":"#DIV/0!"}},{"$f":"IF(MOD(M10,Input!$G$61)=0,($D$61+M10*$B$2*$D$61),0)","v":{"$error":"#DIV/0!"}},{"$f":"IF(MOD(N10,Input!$G$61)=0,($D$61+N10*$B$2*$D$61),0)","v":{"$error":"#DIV/0!"}},{"$f":"IF(MOD(O10,Input!$G$61)=0,($D$61+O10*$B$2*$D$61),0)","v":{"$error":"#DIV/0!"}},{"$f":"IF(MOD(P10,Input!$G$61)=0,($D$61+P10*$B$2*$D$61),0)","v":{"$error":"#DIV/0!"}},{"$f":"IF(MOD(Q10,Input!$G$61)=0,($D$61+Q10*$B$2*$D$61),0)","v":{"$error":"#DIV/0!"}},{"$f":"IF(MOD(R10,Input!$G$61)=0,($D$61+R10*$B$2*$D$61),0)","v":{"$error":"#DIV/0!"}},{"$f":"IF(MOD(S10,Input!$G$61)=0,($D$61+S10*$B$2*$D$61),0)","v":{"$error":"#DIV/0!"}},{"$f":"IF(MOD(T10,Input!$G$61)=0,($D$61+T10*$B$2*$D$61),0)","v":{"$error":"#DIV/0!"}},{"$f":"IF(MOD(U10,Input!$G$61)=0,($D$61+U10*$B$2*$D$61),0)","v":{"$error":"#DIV/0!"}},{"$f":"IF(MOD(V10,Input!$G$61)=0,($D$61+V10*$B$2*$D$61),0)","v":{"$error":"#DIV/0!"}},{"$f":"IF(MOD(W10,Input!$G$61)=0,($D$61+W10*$B$2*$D$61),0)","v":{"$error":"#DIV/0!"}},{"$f":"IF(MOD(X10,Input!$G$61)=0,($D$61+X10*$B$2*$D$61),0)","v":{"$error":"#DIV/0!"}},{"$f":"IF(MOD(Y10,Input!$G$61)=0,($D$61+Y10*$B$2*$D$61),0)","v":{"$error":"#DIV/0!"}},{"$f":"IF(MOD(Z10,Input!$G$61)=0,($D$61+Z10*$B$2*$D$61),0)","v":{"$error":"#DIV/0!"}},{"$f":"IF(MOD(AA10,Input!$G$61)=0,($D$61+AA10*$B$2*$D$61),0)","v":{"$error":"#DIV/0!"}},{"$f":"IF(MOD(AB10,Input!$G$61)=0,($D$61+AB10*$B$2*$D$61),0)","v":{"$error":"#DIV/0!"}},{"$f":"IF(MOD(AC10,Input!$G$61)=0,($D$61+AC10*$B$2*$D$61),0)","v":{"$error":"#DIV/0!"}}]
[{"$f":"Input!C62","v":"Control unit"},null,{"$f":"IF(Input!$E$8=\"\",\"\",Input!$E$8)","v":""},{"$f":"Input!E62","v":0},{"$f":"IF(MOD(E10,Input!$G$62)=0,($D$62+E10*$B$2*$D$62),0)","v":{"$error":"#DIV/0!"}},{"$f":"IF(MOD(F10,Input!$G$62)=0,($D$62+F10*$B$2*$D$62),0)","v":{"$error":"#DIV/0!"}},{"$f":"IF(MOD(G10,Input!$G$62)=0,($D$62+G10*$B$2*$D$62),0)","v":{"$error":"#DIV/0!"}},{"$f":"IF(MOD(H10,Input!$G$62)=0,($D$62+H10*$B$2*$D$62),0)","v":{"$error":"#DIV/0!"}},{"$f":"IF(MOD(I10,Input!$G$62)=0,($D$62+I10*$B$2*$D$62),0)","v":{"$error":"#DIV/0!"}},{"$f":"IF(MOD(J10,Input!$G$62)=0,($D$62+J10*$B$2*$D$62),0)","v":{"$error":"#DIV/0!"}},{"$f":"IF(MOD(K10,Input!$G$62)=0,($D$62+K10*$B$2*$D$62),0)","v":{"$error":"#DIV/0!"}},{"$f":"IF(MOD(L10,Input!$G$62)=0,($D$62+L10*$B$2*$D$62),0)","v":{"$error":"#DIV/0!"}},{"$f":"IF(MOD(M10,Input!$G$62)=0,($D$62+M10*$B$2*$D$62),0)","v":{"$error":"#DIV/0!"}},{"$f":"IF(MOD(N10,Input!$G$62)=0,($D$62+N10*$B$2*$D$62),0)","v":{"$error":"#DIV/0!"}},{"$f":"IF(MOD(O10,Input!$G$62)=0,($D$62+O10*$B$2*$D$62),0)","v":{"$error":"#DIV/0!"}},{"$f":"IF(MOD(P10,Input!$G$62)=0,($D$62+P10*$B$2*$D$62),0)","v":{"$error":"#DIV/0!"}},{"$f":"IF(MOD(Q10,Input!$G$62)=0,($D$62+Q10*$B$2*$D$62),0)","v":{"$error":"#DIV/0!"}},{"$f":"IF(MOD(R10,Input!$G$62)=0,($D$62+R10*$B$2*$D$62),0)","v":{"$error":"#DIV/0!"}},{"$f":"IF(MOD(S10,Input!$G$62)=0,($D$62+S10*$B$2*$D$62),0)","v":{"$error":"#DIV/0!"}},{"$f":"IF(MOD(T10,Input!$G$62)=0,($D$62+T10*$B$2*$D$62),0)","v":{"$error":"#DIV/0!"}},{"$f":"IF(MOD(U10,Input!$G$62)=0,($D$62+U10*$B$2*$D$62),0)","v":{"$error":"#DIV/0!"}},{"$f":"IF(MOD(V10,Input!$G$62)=0,($D$62+V10*$B$2*$D$62),0)","v":{"$error":"#DIV/0!"}},{"$f":"IF(MOD(W10,Input!$G$62)=0,($D$62+W10*$B$2*$D$62),0)","v":{"$error":"#DIV/0!"}},{"$f":"IF(MOD(X10,Input!$G$62)=0,($D$62+X10*$B$2*$D$62),0)","v":{"$error":"#DIV/0!"}},{"$f":"IF(MOD(Y10,Input!$G$62)=0,($D$62+Y10*$B$2*$D$62),0)","v":{"$error":"#DIV/0!"}},{"$f":"IF(MOD(Z10,Input!$G$62)=0,($D$62+Z10*$B$2*$D$62),0)","v":{"$error":"#DIV/0!"}},{"$f":"IF(MOD(AA10,Input!$G$62)=0,($D$62+AA10*$B$2*$D$62),0)","v":{"$error":"#DIV/0!"}},{"$f":"IF(MOD(AB10,Input!$G$62)=0,($D$62+AB10*$B$2*$D$62),0)","v":{"$error":"#DIV/0!"}},{"$f":"IF(MOD(AC10,Input!$G$62)=0,($D$62+AC10*$B$2*$D$62),0)","v":{"$error":"#DIV/0!"}}]
[{"$f":"Input!C63","v":"Pump"},null,{"$f":"IF(Input!$E$8=\"\",\"\",Input!$E$8)","v":""},{"$f":"Input!E63","v":0},{"$f":"IF(MOD(E10,Input!$G$63)=0,($D$63+E10*$B$2*$D$63),0)","v":{"$error":"#DIV/0!"}},{"$f":"IF(MOD(F10,Input!$G$63)=0,($D$63+F10*$B$2*$D$63),0)","v":{"$error":"#DIV/0!"}},{"$f":"IF(MOD(G10,Input!$G$63)=0,($D$63+G10*$B$2*$D$63),0)","v":{"$error":"#DIV/0!"}},{"$f":"IF(MOD(H10,Input!$G$63)=0,($D$63+H10*$B$2*$D$63),0)","v":{"$error":"#DIV/0!"}},{"$f":"IF(MOD(I10,Input!$G$63)=0,($D$63+I10*$B$2*$D$63),0)","v":{"$error":"#DIV/0!"}},{"$f":"IF(MOD(J10,Input!$G$63)=0,($D$63+J10*$B$2*$D$63),0)","v":{"$error":"#DIV/0!"}},{"$f":"IF(MOD(K10,Input!$G$63)=0,($D$63+K10*$B$2*$D$63),0)","v":{"$error":"#DIV/0!"}},{"$f":"IF(MOD(L10,Input!$G$63)=0,($D$63+L10*$B$2*$D$63),0)","v":{"$error":"#DIV/0!"}},{"$f":"IF(MOD(M10,Input!$G$63)=0,($D$63+M10*$B$2*$D$63),0)","v":{"$error":"#DIV/0!"}},{"$f":"IF(MOD(N10,Input!$G$63)=0,($D$63+N10*$B$2*$D$63),0)","v":{"$error":"#DIV/0!"}},{"$f":"IF(MOD(O10,Input!$G$63)=0,($D$63+O10*$B$2*$D$63),0)","v":{"$error":"#DIV/0!"}},{"$f":"IF(MOD(P10,Input!$G$63)=0,($D$63+P10*$B$2*$D$63),0)","v":{"$error":"#DIV/0!"}},{"$f":"IF(MOD(Q10,Input!$G$63)=0,($D$63+Q10*$B$2*$D$63),0)","v":{"$error":"#DIV/0!"}},{"$f":"IF(MOD(R10,Input!$G$63)=0,($D$63+R10*$B$2*$D$63),0)","v":{"$error":"#DIV/0!"}},{"$f":"IF(MOD(S10,Input!$G$63)=0,($D$63+S10*$B$2*$D$63),0)","v":{"$error":"#DIV/0!"}},{"$f":"IF(MOD(T10,Input!$G$63)=0,($D$63+T10*$B$2*$D$63),0)","v":{"$error":"#DIV/0!"}},{"$f":"IF(MOD(U10,Input!$G$63)=0,($D$63+U10*$B$2*$D$63),0)","v":{"$error":"#DIV/0!"}},{"$f":"IF(MOD(V10,Input!$G$63)=0,($D$63+V10*$B$2*$D$63),0)","v":{"$error":"#DIV/0!"}},{"$f":"IF(MOD(W10,Input!$G$63)=0,($D$63+W10*$B$2*$D$63),0)","v":{"$error":"#DIV/0!"}},{"$f":"IF(MOD(X10,Input!$G$63)=0,($D$63+X10*$B$2*$D$63),0)","v":{"$error":"#DIV/0!"}},{"$f":"IF(MOD(Y10,Input!$G$63)=0,($D$63+Y10*$B$2*$D$63),0)","v":{"$error":"#DIV/0!"}},{"$f":"IF(MOD(Z10,Input!$G$63)=0,($D$63+Z10*$B$2*$D$63),0)","v":{"$error":"#DIV/0!"}},{"$f":"IF(MOD(AA10,Input!$G$63)=0,($D$63+AA10*$B$2*$D$63),0)","v":{"$error":"#DIV/0!"}},{"$f":"IF(MOD(AB10,Input!$G$63)=0,($D$63+AB10*$B$2*$D$63),0)","v":{"$error":"#DIV/0!"}},{"$f":"IF(MOD(AC10,Input!$G$63)=0,($D$63+AC10*$B$2*$D$63),0)","v":{"$error":"#DIV/0!"}}]
["Wires / tubes",null,{"$f":"IF(Input!$E$8=\"\",\"\",Input!$E$8)","v":""},{"$f":"Input!E64","v":0},{"$f":"IF(MOD(E10,Input!$G$64)=0,($D$64+E10*$B$2*$D$64),0)","v":{"$error":"#DIV/0!"}},{"$f":"IF(MOD(F10,Input!$G$64)=0,($D$64+F10*$B$2*$D$64),0)","v":{"$error":"#DIV/0!"}},{"$f":"IF(MOD(G10,Input!$G$64)=0,($D$64+G10*$B$2*$D$64),0)","v":{"$error":"#DIV/0!"}},{"$f":"IF(MOD(H10,Input!$G$64)=0,($D$64+H10*$B$2*$D$64),0)","v":{"$error":"#DIV/0!"}},{"$f":"IF(MOD(I10,Input!$G$64)=0,($D$64+I10*$B$2*$D$64),0)","v":{"$error":"#DIV/0!"}},{"$f":"IF(MOD(J10,Input!$G$64)=0,($D$64+J10*$B$2*$D$64),0)","v":{"$error":"#DIV/0!"}},{"$f":"IF(MOD(K10,Input!$G$64)=0,($D$64+K10*$B$2*$D$64),0)","v":{"$error":"#DIV/0!"}},{"$f":"IF(MOD(L10,Input!$G$64)=0,($D$64+L10*$B$2*$D$64),0)","v":{"$error":"#DIV/0!"}},{"$f":"IF(MOD(M10,Input!$G$64)=0,($D$64+M10*$B$2*$D$64),0)","v":{"$error":"#DIV/0!"}},{"$f":"IF(MOD(N10,Input!$G$64)=0,($D$64+N10*$B$2*$D$64),0)","v":{"$error":"#DIV/0!"}},{"$f":"IF(MOD(O10,Input!$G$64)=0,($D$64+O10*$B$2*$D$64),0)","v":{"$error":"#DIV/0!"}},{"$f":"IF(MOD(P10,Input!$G$64)=0,($D$64+P10*$B$2*$D$64),0)","v":{"$error":"#DIV/0!"}},{"$f":"IF(MOD(Q10,Input!$G$64)=0,($D$64+Q10*$B$2*$D$64),0)","v":{"$error":"#DIV/0!"}},{"$f":"IF(MOD(R10,Input!$G$64)=0,($D$64+R10*$B$2*$D$64),0)","v":{"$error":"#DIV/0!"}},{"$f":"IF(MOD(S10,Input!$G$64)=0,($D$64+S10*$B$2*$D$64),0)","v":{"$error":"#DIV/0!"}},{"$f":"IF(MOD(T10,Input!$G$64)=0,($D$64+T10*$B$2*$D$64),0)","v":{"$error":"#DIV/0!"}},{"$f":"IF(MOD(U10,Input!$G$64)=0,($D$64+U10*$B$2*$D$64),0)","v":{"$error":"#DIV/0!"}},{"$f":"IF(MOD(V10,Input!$G$64)=0,($D$64+V10*$B$2*$D$64),0)","v":{"$error":"#DIV/0!"}},{"$f":"IF(MOD(W10,Input!$G$64)=0,($D$64+W10*$B$2*$D$64),0)","v":{"$error":"#DIV/0!"}},{"$f":"IF(MOD(X10,Input!$G$64)=0,($D$64+X10*$B$2*$D$64),0)","v":{"$error":"#DIV/0!"}},{"$f":"IF(MOD(Y10,Input!$G$64)=0,($D$64+Y10*$B$2*$D$64),0)","v":{"$error":"#DIV/0!"}},{"$f":"IF(MOD(Z10,Input!$G$64)=0,($D$64+Z10*$B$2*$D$64),0)","v":{"$error":"#DIV/0!"}},{"$f":"IF(MOD(AA10,Input!$G$64)=0,($D$64+AA10*$B$2*$D$64),0)","v":{"$error":"#DIV/0!"}},{"$f":"IF(MOD(AB10,Input!$G$64)=0,($D$64+AB10*$B$2*$D$64),0)","v":{"$error":"#DIV/0!"}},{"$f":"IF(MOD(AC10,Input!$G$64)=0,($D$64+AC10*$B$2*$D$64),0)","v":{"$error":"#DIV/0!"}}]
[{"$f":"Input!C65","v":"Water storage"},null,{"$f":"IF(Input!$E$8=\"\",\"\",Input!$E$8)","v":""},{"$f":"Input!E65","v":0},{"$f":"IF(MOD(E10,Input!$G$65)=0,($D$65+E10*$B$2*$D$65),0)","v":{"$error":"#DIV/0!"}},{"$f":"IF(MOD(F10,Input!$G$65)=0,($D$65+F10*$B$2*$D$65),0)","v":{"$error":"#DIV/0!"}},{"$f":"IF(MOD(G10,Input!$G$65)=0,($D$65+G10*$B$2*$D$65),0)","v":{"$error":"#DIV/0!"}},{"$f":"IF(MOD(H10,Input!$G$65)=0,($D$65+H10*$B$2*$D$65),0)","v":{"$error":"#DIV/0!"}},{"$f":"IF(MOD(I10,Input!$G$65)=0,($D$65+I10*$B$2*$D$65),0)","v":{"$error":"#DIV/0!"}},{"$f":"IF(MOD(J10,Input!$G$65)=0,($D$65+J10*$B$2*$D$65),0)","v":{"$error":"#DIV/0!"}},{"$f":"IF(MOD(K10,Input!$G$65)=0,($D$65+K10*$B$2*$D$65),0)","v":{"$error":"#DIV/0!"}},{"$f":"IF(MOD(L10,Input!$G$65)=0,($D$65+L10*$B$2*$D$65),0)","v":{"$error":"#DIV/0!"}},{"$f":"IF(MOD(M10,Input!$G$65)=0,($D$65+M10*$B$2*$D$65),0)","v":{"$error":"#DIV/0!"}},{"$f":"IF(MOD(N10,Input!$G$65)=0,($D$65+N10*$B$2*$D$65),0)","v":{"$error":"#DIV/0!"}},{"$f":"IF(MOD(O10,Input!$G$65)=0,($D$65+O10*$B$2*$D$65),0)","v":{"$error":"#DIV/0!"}},{"$f":"IF(MOD(P10,Input!$G$65)=0,($D$65+P10*$B$2*$D$65),0)","v":{"$error":"#DIV/0!"}},{"$f":"IF(MOD(Q10,Input!$G$65)=0,($D$65+Q10*$B$2*$D$65),0)","v":{"$error":"#DIV/0!"}},{"$f":"IF(MOD(R10,Input!$G$65)=0,($D$65+R10*$B$2*$D$65),0)","v":{"$error":"#DIV/0!"}},{"$f":"IF(MOD(S10,Input!$G$65)=0,($D$65+S10*$B$2*$D$65),0)","v":{"$error":"#DIV/0!"}},{"$f":"IF(MOD(T10,Input!$G$65)=0,($D$65+T10*$B$2*$D$65),0)","v":{"$error":"#DIV/0!"}},{"$f":"IF(MOD(U10,Input!$G$65)=0,($D$65+U10*$B$2*$D$65),0)","v":{"$error":"#DIV/0!"}},{"$f":"IF(MOD(V10,Input!$G$65)=0,($D$65+V10*$B$2*$D$65),0)","v":{"$error":"#DIV/0!"}},{"$f":"IF(MOD(W10,Input!$G$65)=0,($D$65+W10*$B$2*$D$65),0)","v":{"$error":"#DIV/0!"}},{"$f":"IF(MOD(X10,Input!$G$65)=0,($D$65+X10*$B$2*$D$65),0)","v":{"$error":"#DIV/0!"}},{"$f":"IF(MOD(Y10,Input!$G$65)=0,($D$65+Y10*$B$2*$D$65),0)","v":{"$error":"#DIV/0!"}},{"$f":"IF(MOD(Z10,Input!$G$65)=0,($D$65+Z10*$B$2*$D$65),0)","v":{"$error":"#DIV/0!"}},{"$f":"IF(MOD(AA10,Input!$G$65)=0,($D$65+AA10*$B$2*$D$65),0)","v":{"$error":"#DIV/0!"}},{"$f":"IF(MOD(AB10,Input!$G$65)=0,($D$65+AB10*$B$2*$D$65),0)","v":{"$error":"#DIV/0!"}},{"$f":"IF(MOD(AC10,Input!$G$65)=0,($D$65+AC10*$B$2*$D$65),0)","v":{"$error":"#DIV/0!"}}]
["Irrigation system",null,{"$f":"IF(Input!$E$8=\"\",\"\",Input!$E$8)","v":""},{"$f":"Input!E66","v":0},{"$f":"IF(MOD(E10,Input!$G$66)=0,($D$66+E10*$B$2*$D$66),0)","v":{"$error":"#DIV/0!"}},{"$f":"IF(MOD(F10,Input!$G$66)=0,($D$66+F10*$B$2*$D$66),0)","v":{"$error":"#DIV/0!"}},{"$f":"IF(MOD(G10,Input!$G$66)=0,($D$66+G10*$B$2*$D$66),0)","v":{"$error":"#DIV/0!"}},{"$f":"IF(MOD(H10,Input!$G$66)=0,($D$66+H10*$B$2*$D$66),0)","v":{"$error":"#DIV/0!"}},{"$f":"IF(MOD(I10,Input!$G$66)=0,($D$66+I10*$B$2*$D$66),0)","v":{"$error":"#DIV/0!"}},{"$f":"IF(MOD(J10,Input!$G$66)=0,($D$66+J10*$B$2*$D$66),0)","v":{"$error":"#DIV/0!"}},{"$f":"IF(MOD(K10,Input!$G$66)=0,($D$66+K10*$B$2*$D$66),0)","v":{"$error":"#DIV/0!"}},{"$f":"IF(MOD(L10,Input!$G$66)=0,($D$66+L10*$B$2*$D$66),0)","v":{"$error":"#DIV/0!"}},{"$f":"IF(MOD(M10,Input!$G$66)=0,($D$66+M10*$B$2*$D$66),0)","v":{"$error":"#DIV/0!"}},{"$f":"IF(MOD(N10,Input!$G$66)=0,($D$66+N10*$B$2*$D$66),0)","v":{"$error":"#DIV/0!"}},{"$f":"IF(MOD(O10,Input!$G$66)=0,($D$66+O10*$B$2*$D$66),0)","v":{"$error":"#DIV/0!"}},{"$f":"IF(MOD(P10,Input!$G$66)=0,($D$66+P10*$B$2*$D$66),0)","v":{"$error":"#DIV/0!"}},{"$f":"IF(MOD(Q10,Input!$G$66)=0,($D$66+Q10*$B$2*$D$66),0)","v":{"$error":"#DIV/0!"}},{"$f":"IF(MOD(R10,Input!$G$66)=0,($D$66+R10*$B$2*$D$66),0)","v":{"$error":"#DIV/0!"}},{"$f":"IF(MOD(S10,Input!$G$66)=0,($D$66+S10*$B$2*$D$66),0)","v":{"$error":"#DIV/0!"}},{"$f":"IF(MOD(T10,Input!$G$66)=0,($D$66+T10*$B$2*$D$66),0)","v":{"$error":"#DIV/0!"}},{"$f":"IF(MOD(U10,Input!$G$66)=0,($D$66+U10*$B$2*$D$66),0)","v":{"$error":"#DIV/0!"}},{"$f":"IF(MOD(V10,Input!$G$66)=0,($D$66+V10*$B$2*$D$66),0)","v":{"$error":"#DIV/0!"}},{"$f":"IF(MOD(W10,Input!$G$66)=0,($D$66+W10*$B$2*$D$66),0)","v":{"$error":"#DIV/0!"}},{"$f":"IF(MOD(X10,Input!$G$66)=0,($D$66+X10*$B$2*$D$66),0)","v":{"$error":"#DIV/0!"}},{"$f":"IF(MOD(Y10,Input!$G$66)=0,($D$66+Y10*$B$2*$D$66),0)","v":{"$error":"#DIV/0!"}},{"$f":"IF(MOD(Z10,Input!$G$66)=0,($D$66+Z10*$B$2*$D$66),0)","v":{"$error":"#DIV/0!"}},{"$f":"IF(MOD(AA10,Input!$G$66)=0,($D$66+AA10*$B$2*$D$66),0)","v":{"$error":"#DIV/0!"}},{"$f":"IF(MOD(AB10,Input!$G$66)=0,($D$66+AB10*$B$2*$D$66),0)","v":{"$error":"#DIV/0!"}},{"$f":"IF(MOD(AC10,Input!$G$66)=0,($D$66+AC10*$B$2*$D$66),0)","v":{"$error":"#DIV/0!"}}]
["Drilling",null,{"$f":"IF(Input!$E$8=\"\",\"\",Input!$E$8)","v":""},{"$f":"Input!E67","v":0}]
["Installation",null,{"$f":"IF(Input!$E$8=\"\",\"\",Input!$E$8)","v":""},{"$f":"Input!E68","v":0}]
["Other Costs",null,{"$f":"IF(Input!$E$8=\"\",\"\",Input!$E$8)","v":""},{"$f":"Input!E69","v":0}]
["Loan Repayment",null,{"$f":"IF(Input!$E$8=\"\",\"\",Input!$E$8)","v":""},0,{"$f":"IF(E10<='Loan Repayment Grid'!Loan_Years,'Loan Repayment Grid'!Scheduled_Monthly_Payment,0)","v":0},{"$f":"IF(F10<='Loan Repayment Grid'!Loan_Years,'Loan Repayment Grid'!Scheduled_Monthly_Payment,0)","v":0},{"$f":"IF(G10<='Loan Repayment Grid'!Loan_Years,'Loan Repayment Grid'!Scheduled_Monthly_Payment,0)","v":0},{"$f":"IF(H10<='Loan Repayment Grid'!Loan_Years,'Loan Repayment Grid'!Scheduled_Monthly_Payment,0)","v":0},{"$f":"IF(I10<='Loan Repayment Grid'!Loan_Years,'Loan Repayment Grid'!Scheduled_Monthly_Payment,0)","v":0},{"$f":"IF(J10<='Loan Repayment Grid'!Loan_Years,'Loan Repayment Grid'!Scheduled_Monthly_Payment,0)","v":0},{"$f":"IF(K10<='Loan Repayment Grid'!Loan_Years,'Loan Repayment Grid'!Scheduled_Monthly_Payment,0)","v":0},{"$f":"IF(L10<='Loan Repayment Grid'!Loan_Years,'Loan Repayment Grid'!Scheduled_Monthly_Payment,0)","v":0},{"$f":"IF(M10<='Loan Repayment Grid'!Loan_Years,'Loan Repayment Grid'!Scheduled_Monthly_Payment,0)","v":0},{"$f":"IF(N10<='Loan Repayment Grid'!Loan_Years,'Loan Repayment Grid'!Scheduled_Monthly_Payment,0)","v":0},{"$f":"IF(O10<='Loan Repayment Grid'!Loan_Years,'Loan Repayment Grid'!Scheduled_Monthly_Payment,0)","v":0},{"$f":"IF(P10<='Loan Repayment Grid'!Loan_Years,'Loan Repayment Grid'!Scheduled_Monthly_Payment,0)","v":0},{"$f":"IF(Q10<='Loan Repayment Grid'!Loan_Years,'Loan Repayment Grid'!Scheduled_Monthly_Payment,0)","v":0},{"$f":"IF(R10<='Loan Repayment Grid'!Loan_Years,'Loan Repayment Grid'!Scheduled_Monthly_Payment,0)","v":0},{"$f":"IF(S10<='Loan Repayment Grid'!Loan_Years,'Loan Repayment Grid'!Scheduled_Monthly_Payment,0)","v":0},{"$f":"IF(T10<='Loan Repayment Grid'!Loan_Years,'Loan Repayment Grid'!Scheduled_Monthly_Payment,0)","v":0},{"$f":"IF(U10<='Loan Repayment Grid'!Loan_Years,'Loan Repayment Grid'!Scheduled_Monthly_Payment,0)","v":0},{"$f":"IF(V10<='Loan Repayment Grid'!Loan_Years,'Loan Repayment Grid'!Scheduled_Monthly_Payment,0)","v":0},{"$f":"IF(W10<='Loan Repayment Grid'!Loan_Years,'Loan Repayment Grid'!Scheduled_Monthly_Payment,0)","v":0},{"$f":"IF(X10<='Loan Repayment Grid'!Loan_Years,'Loan Repayment Grid'!Scheduled_Monthly_Payment,0)","v":0},{"$f":"IF(Y10<='Loan Repayment Grid'!Loan_Years,'Loan Repayment Grid'!Scheduled_Monthly_Payment,0)","v":0},{"$f":"IF(Z10<='Loan Repayment Grid'!Loan_Years,'Loan Repayment Grid'!Scheduled_Monthly_Payment,0)","v":0},{"$f":"IF(AA10<='Loan Repayment Grid'!Loan_Years,'Loan Repayment Grid'!Scheduled_Monthly_Payment,0)","v":0},{"$f":"IF(AB10<='Loan Repayment Grid'!Loan_Years,'Loan Repayment Grid'!Scheduled_Monthly_Payment,0)","v":0},{"$f":"IF(AC10<='Loan Repayment Grid'!Loan_Years,'Loan Repayment Grid'!Scheduled_Monthly_Payment,0)","v":0}]
["Electricity costs:",null,{"$f":"IF(Input!$E$8=\"\",\"\",Input!$E$8)","v":""},0,{"$f":"Input!E74","v":{"$error":"#DIV/0!"}},{"$f":"E71*(1+(1*$B$6))","v":{"$error":"#DIV/0!"}},{"$f":"F71*(1+(1*$B$6))","v":{"$error":"#DIV/0!"}},{"$f":"G71*(1+(1*$B$6))","v":{"$error":"#DIV/0!"}},{"$error":"#DIV/0!"},{"$error":"#DIV/0!"},{"$error":"#DIV/0!"},{"$error":"#DIV/0!"},{"$error":"#DIV/0!"},{"$error":"#DIV/0!"},{"$error":"#DIV/0!"},{"$error":"#DIV/0!"},{"$error":"#DIV/0!"},{"$error":"#DIV/0!"},{"$error":"#DIV/0!"},{"$error":"#DIV/0!"},{"$error":"#DIV/0!"},{"$error":"#DIV/0!"},{"$error":"#DIV/0!"},{"$error":"#DIV/0!"},{"$error":"#DIV/0!"},{"$error":"#DIV/0!"},{"$error":"#DIV/0!"},{"$error":"#DIV/0!"},{"$error":"#DIV/0!"}]
["Operating Costs:",null,{"$f":"IF(Input!$E$8=\"\",\"\",Input!$E$8)","v":""},0,{"$f":"SUM(Input!E75:E76)","v":0},{"$f":"E72*(1+(1*$B$2))","v":0},0,0,0,0,0,0,0,0,0,0,0,0,0,0,0,0,0,0,0,0,0,0,0]
[]
[]
["Gross Expenses System per year:",null,{"$f":"IF(Input!$E$8=\"\",\"\",Input!$E$8)","v":""},{"$f":"SUM(D61:D69)","v":0},{"$f":"E71+E72+SUMIF(E61:E70,\"<1E+307\")","v":{"$error":"#DIV/0!"}},{"$f":"F71+F72+SUMIF(F61:F70,\"<1E+307\")","v":{"$error":"#DIV/0!"}},{"$error":"#DIV/0!"},{"$error":"#DIV/0!"},{"$error":"#DIV/0!"},{"$error":"#DIV/0!"},{"$error":"#DIV/0!"},{"$error":"#DIV/0!"},{"$error":"#DIV/0!"},{"$error":"#DIV/0!"},{"$error":"#DIV/0!"},{"$error":"#DIV/0!"},{"$error":"#DIV/0!"},{"$error":"#DIV/0!"},{"$error":"#DIV/0!"},{"$error":"#DIV/0!"},{"$error":"#DIV/0!"},{"$error":"#DIV/0!"},{"$error":"#DIV/0!"},{"$error":"#DIV/0!"},{"$error":"#DIV/0!"},{"$error":"#DIV/0!"},{"$error":"#DIV/0!"},{"$error":"#DIV/0!"},{"$error":"#DIV/0!"}]
[]
[]
["Cash Flow:",null,{"$f":"IF(Input!$E$8=\"\",\"\",Input!$E$8)","v":""},{"$f":"D13-D83","v":0},{"$f":"E13-E83","v":{"$error":"#DIV/0!"}},{"$error":"#DIV/0!"},{"$error":"#DIV/0!"},{"$error":"#DIV/0!"},{"$error":"#DIV/0!"},{"$error":"#DIV/0!"},{"$error":"#DIV/0!"},{"$error":"#DIV/0!"},{"$error":"#DIV/0!"},{"$error":"#DIV/0!"},{"$error":"#DIV/0!"},{"$error":"#DIV/0!"},{"$error":"#DIV/0!"},{"$error":"#DIV/0!"},{"$error":"#DIV/0!"},{"$error":"#DIV/0!"},{"$error":"#DIV/0!"},{"$error":"#DIV/0!"},{"$error":"#DIV/0!"},{"$error":"#DIV/0!"},{"$error":"#DIV/0!"},{"$error":"#DIV/0!"},{"$error":"#DIV/0!"},{"$error":"#DIV/0!"},{"$error":"#DIV/0!"}]
[]
[null,null,null,{"$f":"IF(D78>0,\"Yes\",\"No\")","v":"No"},{"$f":"IF(E78>0,\"Yes\",\"No\")","v":{"$error":"#DIV/0!"}},{"$error":"#DIV/0!"},{"$error":"#DIV/0!"},{"$error":"#DIV/0!"},{"$error":"#DIV/0!"},{"$error":"#DIV/0!"},{"$error":"#DIV/0!"},{"$error":"#DIV/0!"},{"$error":"#DIV/0!"},{"$error":"#DIV/0!"},{"$error":"#DIV/0!"},{"$error":"#DIV/0!"},{"$error":"#DIV/0!"},{"$error":"#DIV/0!"},{"$error":"#DIV/0!"},{"$error":"#DIV/0!"},{"$error":"#DIV/0!"},{"$error":"#DIV/0!"},{"$error":"#DIV/0!"},{"$error":"#DIV/0!"},{"$error":"#DIV/0!"},{"$error":"#DIV/0!"},{"$error":"#DIV/0!"},{"$error":"#DIV/0!"},{"$error":"#DIV/0!"}]
["Payback period against investment (years)",{"$f":"IF(AC78<0,\"no payback\",COUNTIF(D78:AC78,\"<0\"))","v":{"$error":"#DIV/0!"}},"years"]
[]
["System Life Cycle Costs",{"$f":"AC84","v":{"$error":"#DIV/0!"}},{"$f":"IF(Input!$E$8=\"\",\"\",Input!$E$8)","v":""},{"$f":"IF($A$84=TRUE,D84,NA())","v":0},{"$error":"#DIV/0!"},{"$error":"#DIV/0!"},{"$error":"#DIV/0!"},{"$error":"#DIV/0!"},{"$error":"#DIV/0!"},{"$error":"#DIV/0!"},{"$error":"#DIV/0!"},{"$error":"#DIV/0!"},{"$error":"#DIV/0!"},{"$error":"#DIV/0!"},{"$error":"#DIV/0!"},{"$error":"#DIV/0!"},{"$error":"#DIV/0!"},{"$error":"#DIV/0!"},{"$error":"#DIV/0!"},{"$error":"#DIV/0!"},{"$error":"#DIV/0!"},{"$error":"#DIV/0!"},{"$error":"#DIV/0!"},{"$error":"#DIV/0!"},{"$error":"#DIV/0!"},{"$error":"#DIV/0!"},{"$error":"#DIV/0!"},{"$error":"#DIV/0!"},{"$error":"#DIV/0!"}]
[true,null,null,{"$f":"D75","v":0},{"$f":"SUM($D$75:E75)","v":{"$error":"#DIV/0!"}},{"$f":"SUM($D$75:F75)","v":{"$error":"#DIV/0!"}},{"$f":"SUM($D$75:G75)","v":{"$error":"#DIV/0!"}},{"$f":"SUM($D$75:H75)","v":{"$error":"#DIV/0!"}},{"$f":"SUM($D$75:I75)","v":{"$error":"#DIV/0!"}},{"$f":"SUM($D$75:J75)","v":{"$error":"#DIV/0!"}},{"$f":"SUM($D$75:K75)","v":{"$error":"#DIV/0!"}},{"$f":"SUM($D$75:L75)","v":{"$error":"#DIV/0!"}},{"$f":"SUM($D$75:M75)","v":{"$error":"#DIV/0!"}},{"$f":"SUM($D$75:N75)","v":{"$error":"#DIV/0!"}},{"$f":"SUM($D$75:O75)","v":{"$error":"#DIV/0!"}},{"$f":"SUM($D$75:P75)","v":{"$error":"#DIV/0!"}},{"$f":"SUM($D$75:Q75)","v":{"$error":"#DIV/0!"}},{"$f":"SUM($D$75:R75)","v":{"$error":"#DIV/0!"}},{"$f":"SUM($D$75:S75)","v":{"$error":"#DIV/0!"}},{"$f":"SUM($D$75:T75)","v":{"$error":"#DIV/0!"}},{"$f":"SUM($D$75:U75)","v":{"$error":"#DIV/0!"}},{"$f":"SUM($D$75:V75)","v":{"$error":"#DIV/0!"}},{"$f":"SUM($D$75:W75)","v":{"$error":"#DIV/0!"}},{"$f":"SUM($D$75:X75)","v":{"$error":"#DIV/0!"}},{"$f":"SUM($D$75:Y75)","v":{"$error":"#DIV/0!"}},{"$f":"SUM($D$75:Z75)","v":{"$error":"#DIV/0!"}},{"$f":"SUM($D$75:AA75)","v":{"$error":"#DIV/0!"}},{"$f":"SUM($D$75:AB75)","v":{"$error":"#DIV/0!"}},{"$f":"SUM($D$75:AC75)","v":{"$error":"#DIV/0!"}}]
["Cost per water (m3)",null,null,{"$f":"D75/($B$8*365)","v":{"$error":"#DIV/0!"}},{"$f":"E75/($B$8*365)","v":{"$error":"#DIV/0!"}},{"$error":"#DIV/0!"},{"$error":"#DIV/0!"},{"$error":"#DIV/0!"},{"$error":"#DIV/0!"},{"$error":"#DIV/0!"},{"$error":"#DIV/0!"},{"$error":"#DIV/0!"},{"$error":"#DIV/0!"},{"$error":"#DIV/0!"},{"$error":"#DIV/0!"},{"$error":"#DIV/0!"},{"$error":"#DIV/0!"},{"$error":"#DIV/0!"},{"$error":"#DIV/0!"},{"$error":"#DIV/0!"},{"$error":"#DIV/0!"},{"$error":"#DIV/0!"},{"$error":"#DIV/0!"},{"$error":"#DIV/0!"},{"$error":"#DIV/0!"},{"$error":"#DIV/0!"},{"$error":"#DIV/0!"},{"$error":"#DIV/0!"},{"$error":"#DIV/0!"}]
[]
[]
["NPV",{"$f":"Input!E12","v":0},{"$f":"NPV(B88,E78:X78)+D78","v":{"$error":"#DIV/0!"}}]
["IRR",null,{"$f":"IRR(D78:X78)","v":{"$error":"#VALUE!"}}]
[]
[]
[]
[]
[]
[]
[{"$nulls":13},"PV",null,"Diesel"]
[{"$nulls":11},"Anuties of Investment",null,{"$f":"C50","v":0},null,{"$f":"C88","v":{"$error":"#DIV/0!"}}]
[]
[{"$nulls":11},"Year",null,"Annuity","NPV","Annuity","NPV"]
[{"$nulls":11},0]
[{"$nulls":11},1,null,{"$f":"PMT($B$50,$L$120,$C$50,0,0)*-1","v":0},{"$f":"N101*(1.05^-L101)","v":0},{"$f":"PMT($B$88,$L$120,$C$88,0,0)*-1","v":{"$error":"#DIV/0!"}},{"$f":"P101*(1.06^-L101)","v":{"$error":"#DIV/0!"}}]
[{"$nulls":11},{"$f":"L101+1","v":2},null,{"$f":"PMT($B$50,$L$120,$C$50,0,0)*-1","v":0},{"$f":"N102*(1.06^-L102)","v":0},{"$f":"PMT($B$88,$L$120,$C$88,0,0)*-1","v":{"$error":"#DIV/0!"}},{"$f":"P102*(1.06^-L102)","v":{"$error":"#DIV/0!"}}]
[{"$nulls":11},3,null,0,0,{"$error":"#DIV/0!"},{"$error":"#DIV/0!"}]
[{"$nulls":11},4,null,0,0,{"$error":"#DIV/0!"},{"$error":"#DIV/0!"}]
[{"$nulls":11},5,null,0,0,{"$error":"#DIV/0!"},{"$error":"#DIV/0!"}]
[{"$nulls":11},6,null,0,0,{"$error":"#DIV/0!"},{"$error":"#DIV/0!"}]
[{"$nulls":11},7,null,0,0,{"$error":"#DIV/0!"},{"$error":"#DIV/0!"}]
[{"$nulls":11},8,null,0,0,{"$error":"#DIV/0!"},{"$error":"#DIV/0!"}]
[{"$nulls":11},9,null,0,0,{"$error":"#DIV/0!"},{"$error":"#DIV/0!"}]
[{"$nulls":11},10,null,0,0,{"$error":"#DIV/0!"},{"$error":"#DIV/0!"}]
[{"$nulls":11},11,null,0,0,{"$error":"#DIV/0!"},{"$error":"#DIV/0!"}]
[{"$nulls":11},12,null,0,0,{"$error":"#DIV/0!"},{"$error":"#DIV/0!"}]
[{"$nulls":11},13,null,0,0,{"$error":"#DIV/0!"},{"$error":"#DIV/0!"}]
[{"$nulls":11},14,null,0,0,{"$error":"#DIV/0!"},{"$error":"#DIV/0!"}]
[{"$nulls":11},15,null,0,0,{"$error":"#DIV/0!"},{"$error":"#DIV/0!"}]
[{"$nulls":11},16,null,0,0,{"$error":"#DIV/0!"},{"$error":"#DIV/0!"}]
[{"$nulls":11},17,null,0,0,{"$error":"#DIV/0!"},{"$error":"#DIV/0!"}]
[{"$nulls":11},18,null,0,0,{"$error":"#DIV/0!"},{"$error":"#DIV/0!"}]
[{"$nulls":11},19,null,0,0,{"$error":"#DIV/0!"},{"$error":"#DIV/0!"}]
[{"$nulls":11},20,null,0,0,{"$error":"#DIV/0!"},{"$error":"#DIV/0!"}]
[]
[{"$nulls":11},"Total",null,null,{"$f":"SUM(O101:O120)","v":0},null,{"$f":"SUM(Q101:Q120)","v":{"$error":"#DIV/0!"}}]
[]
[]
[]
[{"$f":"Input!D89","v":"Diesel powered irrigation system costs"}]
[]
[{"$f":"Input!C93","v":"Generator"},null,{"$f":"IF(Input!$E$8=\"\",\"\",Input!$E$8)","v":""},{"$f":"Input!E93","v":0},{"$f":"IF(MOD(E10,Input!$G$93)=0,($D$128+E10*$B$2*$D$128),0)","v":{"$error":"#DIV/0!"}},{"$f":"IF(MOD(F10,Input!$G$93)=0,($D$128+F10*$B$2*$D$128),0)","v":{"$error":"#DIV/0!"}},{"$f":"IF(MOD(G10,Input!$G$93)=0,($D$128+G10*$B$2*$D$128),0)","v":{"$error":"#DIV/0!"}},{"$f":"IF(MOD(H10,Input!$G$93)=0,($D$128+H10*$B$2*$D$128),0)","v":{"$error":"#DIV/0!"}},{"$f":"IF(MOD(I10,Input!$G$93)=0,($D$128+I10*$B$2*$D$128),0)","v":{"$error":"#DIV/0!"}},{"$f":"IF(MOD(J10,Input!$G$93)=0,($D$128+J10*$B$2*$D$128),0)","v":{"$error":"#DIV/0!"}},{"$f":"IF(MOD(K10,Input!$G$93)=0,($D$128+K10*$B$2*$D$128),0)","v":{"$error":"#DIV/0!"}},{"$f":"IF(MOD(L10,Input!$G$93)=0,($D$128+L10*$B$2*$D$128),0)","v":{"$error":"#DIV/0!"}},{"$f":"IF(MOD(M10,Input!$G$93)=0,($D$128+M10*$B$2*$D$128),0)","v":{"$error":"#DIV/0!"}},{"$f":"IF(MOD(N10,Input!$G$93)=0,($D$128+N10*$B$2*$D$128),0)","v":{"$error":"#DIV/0!"}},{"$f":"IF(MOD(O10,Input!$G$93)=0,($D$128+O10*$B$2*$D$128),0)","v":{"$error":"#DIV/0!"}},{"$f":"IF(MOD(P10,Input!$G$93)=0,($D$128+P10*$B$2*$D$128),0)","v":{"$error":"#DIV/0!"}},{"$f":"IF(MOD(Q10,Input!$G$93)=0,($D$128+Q10*$B$2*$D$128),0)","v":{"$error":"#DIV/0!"}},{"$f":"IF(MOD(R10,Input!$G$93)=0,($D$128+R10*$B$2*$D$128),0)","v":{"$error":"#DIV/0!"}},{"$f":"IF(MOD(S10,Input!$G$93)=0,($D$128+S10*$B$2*$D$128),0)","v":{"$error":"#DIV/0!"}},{"$f":"IF(MOD(T10,Input!$G$93)=0,($D$128+T10*$B$2*$D$128),0)","v":{"$error":"#DIV/0!"}},{"$f":"IF(MOD(U10,Input!$G$93)=0,($D$128+U10*$B$2*$D$128),0)","v":{"$error":"#DIV/0!"}},{"$f":"IF(MOD(V10,Input!$G$93)=0,($D$128+V10*$B$2*$D$128),0)","v":{"$error":"#DIV/0!"}},{"$f":"IF(MOD(W10,Input!$G$93)=0,($D$128+W10*$B$2*$D$128),0)","v":{"$error":"#DIV/0!"}},{"$f":"IF(MOD(X10,Input!$G$93)=0,($D$128+X10*$B$2*$D$128),0)","v":{"$error":"#DIV/0!"}},{"$f":"IF(MOD(Y10,Input!$G$93)=0,($D$128+Y10*$B$2*$D$128),0)","v":{"$error":"#DIV/0!"}},{"$f":"IF(MOD(Z10,Input!$G$93)=0,($D$128+Z10*$B$2*$D$128),0)","v":{"$error":"#DIV/0!"}},{"$f":"IF(MOD(AA10,Input!$G$93)=0,($D$128+AA10*$B$2*$D$128),0)","v":{"$error":"#DIV/0!"}},{"$f":"IF(MOD(AB10,Input!$G$93)=0,($D$128+AB10*$B$2*$D$128),0)","v":{"$error":"#DIV/0!"}},{"$f":"IF(MOD(AC10,Input!$G$93)=0,($D$128+AC10*$B$2*$D$128),0)","v":{"$error":"#DIV/0!"}}]
[{"$f":"Input!C94","v":"Pump"},null,{"$f":"IF(Input!$E$8=\"\",\"\",Input!$E$8)","v":""},{"$f":"Input!E94","v":0},{"$f":"IF(MOD(E10,Input!$G$94)=0,($D$129+E10*$B$2*$D$129),0)","v":{"$error":"#DIV/0!"}},{"$f":"IF(MOD(F10,Input!$G$94)=0,($D$129+F10*$B$2*$D$129),0)","v":{"$error":"#DIV/0!"}},{"$f":"IF(MOD(G10,Input!$G$94)=0,($D$129+G10*$B$2*$D$129),0)","v":{"$error":"#DIV/0!"}},{"$f":"IF(MOD(H10,Input!$G$94)=0,($D$129+H10*$B$2*$D$129),0)","v":{"$error":"#DIV/0!"}},{"$f":"IF(MOD(I10,Input!$G$94)=0,($D$129+I10*$B$2*$D$129),0)","v":{"$error":"#DIV/0!"}},{"$f":"IF(MOD(J10,Input!$G$94)=0,($D$129+J10*$B$2*$D$129),0)","v":{"$error":"#DIV/0!"}},{"$f":"IF(MOD(K10,Input!$G$94)=0,($D$129+K10*$B$2*$D$129),0)","v":{"$error":"#DIV/0!"}},{"$f":"IF(MOD(L10,Input!$G$94)=0,($D$129+L10*$B$2*$D$129),0)","v":{"$error":"#DIV/0!"}},{"$f":"IF(MOD(M10,Input!$G$94)=0,($D$129+M10*$B$2*$D$129),0)","v":{"$error":"#DIV/0!"}},{"$f":"IF(MOD(N10,Input!$G$94)=0,($D$129+N10*$B$2*$D$129),0)","v":{"$error":"#DIV/0!"}},{"$f":"IF(MOD(O10,Input!$G$94)=0,($D$129+O10*$B$2*$D$129),0)","v":{"$error":"#DIV/0!"}},{"$f":"IF(MOD(P10,Input!$G$94)=0,($D$129+P10*$B$2*$D$129),0)","v":{"$error":"#DIV/0!"}},{"$f":"IF(MOD(Q10,Input!$G$94)=0,($D$129+Q10*$B$2*$D$129),0)","v":{"$error":"#DIV/0!"}},{"$f":"IF(MOD(R10,Input!$G$94)=0,($D$129+R10*$B$2*$D$129),0)","v":{"$error":"#DIV/0!"}},{"$f":"IF(MOD(S10,Input!$G$94)=0,($D$129+S10*$B$2*$D$129),0)","v":{"$error":"#DIV/0!"}},{"$f":"IF(MOD(T10,Input!$G$94)=0,($D$129+T10*$B$2*$D$129),0)","v":{"$error":"#DIV/0!"}},{"$f":"IF(MOD(U10,Input!$G$94)=0,($D$129+U10*$B$2*$D$129),0)","v":{"$error":"#DIV/0!"}},{"$f":"IF(MOD(V10,Input!$G$94)=0,($D$129+V10*$B$2*$D$129),0)","v":{"$error":"#DIV/0!"}},{"$f":"IF(MOD(W10,Input!$G$94)=0,($D$129+W10*$B$2*$D$129),0)","v":{"$error":"#DIV/0!"}},{"$f":"IF(MOD(X10,Input!$G$94)=0,($D$129+X10*$B$2*$D$129),0)","v":{"$error":"#DIV/0!"}},{"$f":"IF(MOD(Y10,Input!$G$94)=0,($D$129+Y10*$B$2*$D$129),0)","v":{"$error":"#DIV/0!"}},{"$f":"IF(MOD(Z10,Input!$G$94)=0,($D$129+Z10*$B$2*$D$129),0)","v":{"$error":"#DIV/0!"}},{"$f":"IF(MOD(AA10,Input!$G$94)=0,($D$129+AA10*$B$2*$D$129),0)","v":{"$error":"#DIV/0!"}},{"$f":"IF(MOD(AB10,Input!$G$94)=0,($D$129+AB10*$B$2*$D$129),0)","v":{"$error":"#DIV/0!"}},{"$f":"IF(MOD(AC10,Input!$G$94)=0,($D$129+AC10*$B$2*$D$129),0)","v":{"$error":"#DIV/0!"}}]
["Wires / tubes",null,{"$f":"IF(Input!$E$8=\"\",\"\",Input!$E$8)","v":""},{"$f":"Input!E95","v":0},{"$f":"IF(MOD(E10,Input!$G$95)=0,($D$130+E10*$B$2*$D$130),0)","v":{"$error":"#DIV/0!"}},{"$f":"IF(MOD(F10,Input!$G$95)=0,($D$130+F10*$B$2*$D$130),0)","v":{"$error":"#DIV/0!"}},{"$f":"IF(MOD(G10,Input!$G$95)=0,($D$130+G10*$B$2*$D$130),0)","v":{"$error":"#DIV/0!"}},{"$f":"IF(MOD(H10,Input!$G$95)=0,($D$130+H10*$B$2*$D$130),0)","v":{"$error":"#DIV/0!"}},{"$f":"IF(MOD(I10,Input!$G$95)=0,($D$130+I10*$B$2*$D$130),0)","v":{"$error":"#DIV/0!"}},{"$f":"IF(MOD(J10,Input!$G$95)=0,($D$130+J10*$B$2*$D$130),0)","v":{"$error":"#DIV/0!"}},{"$f":"IF(MOD(K10,Input!$G$95)=0,($D$130+K10*$B$2*$D$130),0)","v":{"$error":"#DIV/0!"}},{"$f":"IF(MOD(L10,Input!$G$95)=0,($D$130+L10*$B$2*$D$130),0)","v":{"$error":"#DIV/0!"}},{"$f":"IF(MOD(M10,Input!$G$95)=0,($D$130+M10*$B$2*$D$130),0)","v":{"$error":"#DIV/0!"}},{"$f":"IF(MOD(N10,Input!$G$95)=0,($D$130+N10*$B$2*$D$130),0)","v":{"$error":"#DIV/0!"}},{"$f":"IF(MOD(O10,Input!$G$95)=0,($D$130+O10*$B$2*$D$130),0)","v":{"$error":"#DIV/0!"}},{"$f":"IF(MOD(P10,Input!$G$95)=0,($D$130+P10*$B$2*$D$130),0)","v":{"$error":"#DIV/0!"}},{"$f":"IF(MOD(Q10,Input!$G$95)=0,($D$130+Q10*$B$2*$D$130),0)","v":{"$error":"#DIV/0!"}},{"$f":"IF(MOD(R10,Input!$G$95)=0,($D$130+R10*$B$2*$D$130),0)","v":{"$error":"#DIV/0!"}},{"$f":"IF(MOD(S10,Input!$G$95)=0,($D$130+S10*$B$2*$D$130),0)","v":{"$error":"#DIV/0!"}},{"$f":"IF(MOD(T10,Input!$G$95)=0,($D$130+T10*$B$2*$D$130),0)","v":{"$error":"#DIV/0!"}},{"$f":"IF(MOD(U10,Input!$G$95)=0,($D$130+U10*$B$2*$D$130),0)","v":{"$error":"#DIV/0!"}},{"$f":"IF(MOD(V10,Input!$G$95)=0,($D$130+V10*$B$2*$D$130),0)","v":{"$error":"#DIV/0!"}},{"$f":"IF(MOD(W10,Input!$G$95)=0,($D$130+W10*$B$2*$D$130),0)","v":{"$error":"#DIV/0!"}},{"$f":"IF(MOD(X10,Input!$G$95)=0,($D$130+X10*$B$2*$D$130),0)","v":{"$error":"#DIV/0!"}},{"$f":"IF(MOD(Y10,Input!$G$95)=0,($D$130+Y10*$B$2*$D$130),0)","v":{"$error":"#DIV/0!"}},{"$f":"IF(MOD(Z10,Input!$G$95)=0,($D$130+Z10*$B$2*$D$130),0)","v":{"$error":"#DIV/0!"}},{"$f":"IF(MOD(AA10,Input!$G$95)=0,($D$130+AA10*$B$2*$D$130),0)","v":{"$error":"#DIV/0!"}},{"$f":"IF(MOD(AB10,Input!$G$95)=0,($D$130+AB10*$B$2*$D$130),0)","v":{"$error":"#DIV/0!"}},{"$f":"IF(MOD(AC10,Input!$G$95)=0,($D$130+AC10*$B$2*$D$130),0)","v":{"$error":"#DIV/0!"}}]
[{"$f":"Input!C96","v":"Water storage"},null,{"$f":"IF(Input!$E$8=\"\",\"\",Input!$E$8)","v":""},{"$f":"Input!E96","v":0},{"$f":"IF(MOD(E10,Input!$G$96)=0,($D$131+E10*$B$2*$D$131),0)","v":{"$error":"#DIV/0!"}},{"$f":"IF(MOD(F10,Input!$G$96)=0,($D$131+F10*$B$2*$D$131),0)","v":{"$error":"#DIV/0!"}},{"$f":"IF(MOD(G10,Input!$G$96)=0,($D$131+G10*$B$2*$D$131),0)","v":{"$error":"#DIV/0!"}},{"$f":"IF(MOD(H10,Input!$G$96)=0,($D$131+H10*$B$2*$D$131),0)","v":{"$error":"#DIV/0!"}},{"$f":"IF(MOD(I10,Input!$G$96)=0,($D$131+I10*$B$2*$D$131),0)","v":{"$error":"#DIV/0!"}},{"$f":"IF(MOD(J10,Input!$G$96)=0,($D$131+J10*$B$2*$D$131),0)","v":{"$error":"#DIV/0!"}},{"$f":"IF(MOD(K10,Input!$G$96)=0,($D$131+K10*$B$2*$D$131),0)","v":{"$error":"#DIV/0!"}},{"$f":"IF(MOD(L10,Input!$G$96)=0,($D$131+L10*$B$2*$D$131),0)","v":{"$error":"#DIV/0!"}},{"$f":"IF(MOD(M10,Input!$G$96)=0,($D$131+M10*$B$2*$D$131),0)","v":{"$error":"#DIV/0!"}},{"$f":"IF(MOD(N10,Input!$G$96)=0,($D$131+N10*$B$2*$D$131),0)","v":{"$error":"#DIV/0!"}},{"$f":"IF(MOD(O10,Input!$G$96)=0,($D$131+O10*$B$2*$D$131),0)","v":{"$error":"#DIV/0!"}},{"$f":"IF(MOD(P10,Input!$G$96)=0,($D$131+P10*$B$2*$D$131),0)","v":{"$error":"#DIV/0!"}},{"$f":"IF(MOD(Q10,Input!$G$96)=0,($D$131+Q10*$B$2*$D$131),0)","v":{"$error":"#DIV/0!"}},{"$f":"IF(MOD(R10,Input!$G$96)=0,($D$131+R10*$B$2*$D$131),0)","v":{"$error":"#DIV/0!"}},{"$f":"IF(MOD(S10,Input!$G$96)=0,($D$131+S10*$B$2*$D$131),0)","v":{"$error":"#DIV/0!"}},{"$f":"IF(MOD(T10,Input!$G$96)=0,($D$131+T10*$B$2*$D$131),0)","v":{"$error":"#DIV/0!"}},{"$f":"IF(MOD(U10,Input!$G$96)=0,($D$131+U10*$B$2*$D$131),0)","v":{"$error":"#DIV/0!"}},{"$f":"IF(MOD(V10,Input!$G$96)=0,($D$131+V10*$B$2*$D$131),0)","v":{"$error":"#DIV/0!"}},{"$f":"IF(MOD(W10,Input!$G$96)=0,($D$131+W10*$B$2*$D$131),0)","v":{"$error":"#DIV/0!"}},{"$f":"IF(MOD(X10,Input!$G$96)=0,($D$131+X10*$B$2*$D$131),0)","v":{"$error":"#DIV/0!"}},{"$f":"IF(MOD(Y10,Input!$G$96)=0,($D$131+Y10*$B$2*$D$131),0)","v":{"$error":"#DIV/0!"}},{"$f":"IF(MOD(Z10,Input!$G$96)=0,($D$131+Z10*$B$2*$D$131),0)","v":{"$error":"#DIV/0!"}},{"$f":"IF(MOD(AA10,Input!$G$96)=0,($D$131+AA10*$B$2*$D$131),0)","v":{"$error":"#DIV/0!"}},{"$f":"IF(MOD(AB10,Input!$G$96)=0,($D$131+AB10*$B$2*$D$131),0)","v":{"$error":"#DIV/0!"}},{"$f":"IF(MOD(AC10,Input!$G$96)=0,($D$131+AC10*$B$2*$D$131),0)","v":{"$error":"#DIV/0!"}}]
["Irrigation system",null,{"$f":"IF(Input!$E$8=\"\",\"\",Input!$E$8)","v":""},{"$f":"Input!E97","v":0},{"$f":"IF(MOD(E10,Input!$G$97)=0,($D$132+E10*$B$2*$D$132),0)","v":{"$error":"#DIV/0!"}},{"$f":"IF(MOD(F10,Input!$G$97)=0,($D$132+F10*$B$2*$D$132),0)","v":{"$error":"#DIV/0!"}},{"$f":"IF(MOD(G10,Input!$G$97)=0,($D$132+G10*$B$2*$D$132),0)","v":{"$error":"#DIV/0!"}},{"$f":"IF(MOD(H10,Input!$G$97)=0,($D$132+H10*$B$2*$D$132),0)","v":{"$error":"#DIV/0!"}},{"$f":"IF(MOD(I10,Input!$G$97)=0,($D$132+I10*$B$2*$D$132),0)","v":{"$error":"#DIV/0!"}},{"$f":"IF(MOD(J10,Input!$G$97)=0,($D$132+J10*$B$2*$D$132),0)","v":{"$error":"#DIV/0!"}},{"$f":"IF(MOD(K10,Input!$G$97)=0,($D$132+K10*$B$2*$D$132),0)","v":{"$error":"#DIV/0!"}},{"$f":"IF(MOD(L10,Input!$G$97)=0,($D$132+L10*$B$2*$D$132),0)","v":{"$error":"#DIV/0!"}},{"$f":"IF(MOD(M10,Input!$G$97)=0,($D$132+M10*$B$2*$D$132),0)","v":{"$error":"#DIV/0!"}},{"$f":"IF(MOD(N10,Input!$G$97)=0,($D$132+N10*$B$2*$D$132),0)","v":{"$error":"#DIV/0!"}},{"$f":"IF(MOD(O10,Input!$G$97)=0,($D$132+O10*$B$2*$D$132),0)","v":{"$error":"#DIV/0!"}},{"$f":"IF(MOD(P10,Input!$G$97)=0,($D$132+P10*$B$2*$D$132),0)","v":{"$error":"#DIV/0!"}},{"$f":"IF(MOD(Q10,Input!$G$97)=0,($D$132+Q10*$B$2*$D$132),0)","v":{"$error":"#DIV/0!"}},{"$f":"IF(MOD(R10,Input!$G$97)=0,($D$132+R10*$B$2*$D$132),0)","v":{"$error":"#DIV/0!"}},{"$f":"IF(MOD(S10,Input!$G$97)=0,($D$132+S10*$B$2*$D$132),0)","v":{"$error":"#DIV/0!"}},{"$f":"IF(MOD(T10,Input!$G$97)=0,($D$132+T10*$B$2*$D$132),0)","v":{"$error":"#DIV/0!"}},{"$f":"IF(MOD(U10,Input!$G$97)=0,($D$132+U10*$B$2*$D$132),0)","v":{"$error":"#DIV/0!"}},{"$f":"IF(MOD(V10,Input!$G$97)=0,($D$132+V10*$B$2*$D$132),0)","v":{"$error":"#DIV/0!"}},{"$f":"IF(MOD(W10,Input!$G$97)=0,($D$132+W10*$B$2*$D$132),0)","v":{"$error":"#DIV/0!"}},{"$f":"IF(MOD(X10,Input!$G$97)=0,($D$132+X10*$B$2*$D$132),0)","v":{"$error":"#DIV/0!"}},{"$f":"IF(MOD(Y10,Input!$G$97)=0,($D$132+Y10*$B$2*$D$132),0)","v":{"$error":"#DIV/0!"}},{"$f":"IF(MOD(Z10,Input!$G$97)=0,($D$132+Z10*$B$2*$D$132),0)","v":{"$error":"#DIV/0!"}},{"$f":"IF(MOD(AA10,Input!$G$97)=0,($D$132+AA10*$B$2*$D$132),0)","v":{"$error":"#DIV/0!"}},{"$f":"IF(MOD(AB10,Input!$G$97)=0,($D$132+AB10*$B$2*$D$132),0)","v":{"$error":"#DIV/0!"}},{"$f":"IF(MOD(AC10,Input!$G$97)=0,($D$132+AC10*$B$2*$D$132),0)","v":{"$error":"#DIV/0!"}}]
["Drilling",null,{"$f":"IF(Input!$E$8=\"\",\"\",Input!$E$8)","v":""},{"$f":"Input!E98","v":0}]
["Installation",null,{"$f":"IF(Input!$E$8=\"\",\"\",Input!$E$8)","v":""},{"$f":"Input!E99","v":0}]
["Other Costs",null,{"$f":"IF(Input!$E$8=\"\",\"\",Input!$E$8)","v":""},{"$f":"Input!E100","v":0}]
["Loan Repayment",null,{"$f":"IF(Input!$E$8=\"\",\"\",Input!$E$8)","v":""},0,{"$f":"IF(E10<='Loan Repayment Diesel'!Loan_Years,'Loan Repayment Diesel'!Scheduled_Monthly_Payment,0)","v":0},{"$f":"IF(F10<='Loan Repayment Diesel'!Loan_Years,'Loan Repayment Diesel'!Scheduled_Monthly_Payment,0)","v":0},{"$f":"IF(G10<='Loan Repayment Diesel'!Loan_Years,'Loan Repayment Diesel'!Scheduled_Monthly_Payment,0)","v":0},{"$f":"IF(H10<='Loan Repayment Diesel'!Loan_Years,'Loan Repayment Diesel'!Scheduled_Monthly_Payment,0)","v":0},{"$f":"IF(I10<='Loan Repayment Diesel'!Loan_Years,'Loan Repayment Diesel'!Scheduled_Monthly_Payment,0)","v":0},{"$f":"IF(J10<='Loan Repayment Diesel'!Loan_Years,'Loan Repayment Diesel'!Scheduled_Monthly_Payment,0)","v":0},{"$f":"IF(K10<='Loan Repayment Diesel'!Loan_Years,'Loan Repayment Diesel'!Scheduled_Monthly_Payment,0)","v":0},{"$f":"IF(L10<='Loan Repayment Diesel'!Loan_Years,'Loan Repayment Diesel'!Scheduled_Monthly_Payment,0)","v":0},{"$f":"IF(M10<='Loan Repayment Diesel'!Loan_Years,'Loan Repayment Diesel'!Scheduled_Monthly_Payment,0)","v":0},{"$f":"IF(N10<='Loan Repayment Diesel'!Loan_Years,'Loan Repayment Diesel'!Scheduled_Monthly_Payment,0)","v":0},{"$f":"IF(O10<='Loan Repayment Diesel'!Loan_Years,'Loan Repayment Diesel'!Scheduled_Monthly_Payment,0)","v":0},{"$f":"IF(P10<='Loan Repayment Diesel'!Loan_Years,'Loan Repayment Diesel'!Scheduled_Monthly_Payment,0)","v":0},{"$f":"IF(Q10<='Loan Repayment Diesel'!Loan_Years,'Loan Repayment Diesel'!Scheduled_Monthly_Payment,0)","v":0},{"$f":"IF(R10<='Loan Repayment Diesel'!Loan_Years,'Loan Repayment Diesel'!Scheduled_Monthly_Payment,0)","v":0},{"$f":"IF(S10<='Loan Repayment Diesel'!Loan_Years,'Loan Repayment Diesel'!Scheduled_Monthly_Payment,0)","v":0},{"$f":"IF(T10<='Loan Repayment Diesel'!Loan_Years,'Loan Repayment Diesel'!Scheduled_Monthly_Payment,0)","v":0},{"$f":"IF(U10<='Loan Repayment Diesel'!Loan_Years,'Loan Repayment Diesel'!Scheduled_Monthly_Payment,0)","v":0},{"$f":"IF(V10<='Loan Repayment Diesel'!Loan_Years,'Loan Repayment Diesel'!Scheduled_Monthly_Payment,0)","v":0},{"$f":"IF(W10<='Loan Repayment Diesel'!Loan_Years,'Loan Repayment Diesel'!Scheduled_Monthly_Payment,0)","v":0},{"$f":"IF(X10<='Loan Repayment Diesel'!Loan_Years,'Loan Repayment Diesel'!Scheduled_Monthly_Payment,0)","v":0},{"$f":"IF(Y10<='Loan Repayment Diesel'!Loan_Years,'Loan Repayment Diesel'!Scheduled_Monthly_Payment,0)","v":0},{"$f":"IF(Z10<='Loan Repayment Diesel'!Loan_Years,'Loan Repayment Diesel'!Scheduled_Monthly_Payment,0)","v":0},{"$f":"IF(AA10<='Loan Repayment Diesel'!Loan_Years,'Loan Repayment Diesel'!Scheduled_Monthly_Payment,0)","v":0},{"$f":"IF(AB10<='Loan Repayment Diesel'!Loan_Years,'Loan Repayment Diesel'!Scheduled_Monthly_Payment,0)","v":0},{"$f":"IF(AC10<='Loan Repayment Diesel'!Loan_Years,'Loan Repayment Diesel'!Scheduled_Monthly_Payment,0)","v":0}]
["Fuel costs:",null,{"$f":"IF(Input!$E$8=\"\",\"\",Input!$E$8)","v":""},0,{"$f":"Input!E105","v":{"$error":"#DIV/0!"}},{"$f":"E137*(1+(1*$B$5))","v":{"$error":"#DIV/0!"}},{"$f":"F137*(1+(1*$B$5))","v":{"$error":"#DIV/0!"}},{"$error":"#DIV/0!"},{"$error":"#DIV/0!"},{"$error":"#DIV/0!"},{"$error":"#DIV/0!"},{"$error":"#DIV/0!"},{"$error":"#DIV/0!"},{"$error":"#DIV/0!"},{"$error":"#DIV/0!"},{"$error":"#DIV/0!"},{"$error":"#DIV/0!"},{"$error":"#DIV/0!"},{"$error":"#DIV/0!"},{"$error":"#DIV/0!"},{"$error":"#DIV/0!"},{"$error":"#DIV/0!"},{"$error":"#DIV/0!"},{"$error":"#DIV/0!"},{"$error":"#DIV/0!"},{"$error":"#DIV/0!"},{"$error":"#DIV/0!"},{"$error":"#DIV/0!"},{"$error":"#DIV/0!"}]
["Operating Costs:",null,{"$f":"IF(Input!$E$8=\"\",\"\",Input!$E$8)","v":""},0,{"$f":"SUM(Input!E106:E107)","v":0},{"$f":"E138*(1+(1*$B$2))","v":0},{"$f":"F138*(1+(1*$B$2))","v":0},{"$f":"G138*(1+(1*$B$2))","v":0},{"$f":"H138*(1+(1*$B$2))","v":0},{"$f":"I138*(1+(1*$B$2))","v":0},{"$f":"J138*(1+(1*$B$2))","v":0},{"$f":"K138*(1+(1*$B$2))","v":0},{"$f":"L138*(1+(1*$B$2))","v":0},{"$f":"M138*(1+(1*$B$2))","v":0},{"$f":"N138*(1+(1*$B$2))","v":0},{"$f":"O138*(1+(1*$B$2))","v":0},{"$f":"P138*(1+(1*$B$2))","v":0},{"$f":"Q138*(1+(1*$B$2))","v":0},{"$f":"R138*(1+(1*$B$2))","v":0},{"$f":"S138*(1+(1*$B$2))","v":0},{"$f":"T138*(1+(1*$B$2))","v":0},{"$f":"U138*(1+(1*$B$2))","v":0},{"$f":"V138*(1+(1*$B$2))","v":0},{"$f":"W138*(1+(1*$B$2))","v":0},{"$f":"X138*(1+(1*$B$2))","v":0},{"$f":"Y138*(1+(1*$B$2))","v":0},{"$f":"Z138*(1+(1*$B$2))","v":0},{"$f":"AA138*(1+(1*$B$2))","v":0},{"$f":"AB138*(1+(1*$B$2))","v":0}]
[]
[]
["Gross Expenses System per year:",null,{"$f":"IF(Input!$E$8=\"\",\"\",Input!$E$8)","v":""},{"$f":"SUM(D128:D135)","v":0},{"$f":"E137+E138+SUMIF(E128:E136,\"<1E+307\")","v":{"$error":"#DIV/0!"}},{"$f":"F137+F138+SUMIF(F128:F136,\"<1E+307\")","v":{"$error":"#DIV/0!"}},{"$error":"#DIV/0!"},{"$error":"#DIV/0!"},{"$error":"#DIV/0!"},{"$error":"#DIV/0!"},{"$error":"#DIV/0!"},{"$error":"#DIV/0!"},{"$error":"#DIV/0!"},{"$error":"#DIV/0!"},{"$error":"#DIV/0!"},{"$error":"#DIV/0!"},{"$error":"#DIV/0!"},{"$error":"#DIV/0!"},{"$error":"#DIV/0!"},{"$error":"#DIV/0!"},{"$error":"#DIV/0!"},{"$error":"#DIV/0!"},{"$error":"#DIV/0!"},{"$error":"#DIV/0!"},{"$error":"#DIV/0!"},{"$error":"#DIV/0!"},{"$f":"AA137+AA138+SUMIF(AA128:AA136,\"<1E+307\")","v":{"$error":"#DIV/0!"}},{"$error":"#DIV/0!"},{"$error":"#DIV/0!"}]
[]
[]
["Cash Flow:",null,{"$f":"IF(Input!$E$8=\"\",\"\",Input!$E$8)","v":""},{"$f":"D13-D149","v":0},{"$f":"E13-E149","v":{"$error":"#DIV/0!"}},{"$f":"F13-F149","v":{"$error":"#DIV/0!"}},{"$f":"G13-G149","v":{"$error":"#DIV/0!"}},{"$error":"#DIV/0!"},{"$error":"#DIV/0!"},{"$error":"#DIV/0!"},{"$error":"#DIV/0!"},{"$error":"#DIV/0!"},{"$error":"#DIV/0!"},{"$error":"#DIV/0!"},{"$error":"#DIV/0!"},{"$error":"#DIV/0!"},{"$error":"#DIV/0!"},{"$error":"#DIV/0!"},{"$error":"#DIV/0!"},{"$error":"#DIV/0!"},{"$error":"#DIV/0!"},{"$error":"#DIV/0!"},{"$error":"#DIV/0!"},{"$error":"#DIV/0!"},{"$error":"#DIV/0!"},{"$error":"#DIV/0!"},{"$error":"#DIV/0!"},{"$error":"#DIV/0!"},{"$error":"#DIV/0!"}]
[]
[null,null,null,{"$f":"IF(D144>0,\"Yes\",\"No\")","v":"No"},{"$f":"IF(E144>0,\"Yes\",\"No\")","v":{"$error":"#DIV/0!"}},{"$error":"#DIV/0!"},{"$error":"#DIV/0!"},{"$error":"#DIV/0!"},{"$error":"#DIV/0!"},{"$error":"#DIV/0!"},{"$error":"#DIV/0!"},{"$error":"#DIV/0!"},{"$error":"#DIV/0!"},{"$error":"#DIV/0!"},{"$error":"#DIV/0!"},{"$error":"#DIV/0!"},{"$error":"#DIV/0!"},{"$error":"#DIV/0!"},{"$error":"#DIV/0!"},{"$error":"#DIV/0!"},{"$error":"#DIV/0!"},{"$f":"IF(V144>0,\"Yes\",\"No\")","v":{"$error":"#DIV/0!"}},{"$error":"#DIV/0!"},{"$error":"#DIV/0!"},{"$error":"#DIV/0!"},{"$error":"#DIV/0!"},{"$error":"#DIV/0!"},{"$error":"#DIV/0!"},{"$error":"#DIV/0!"}]
["Payback period against investment (years)",{"$f":"IF(AC144<0,\"no payback\",COUNTIF(D144:AC144,\"<0\"))","v":{"$error":"#DIV/0!"}},"years"]
[]
["System Life Cycle Costs",{"$f":"AC150","v":{"$error":"#DIV/0!"}},{"$f":"IF(Input!$E$8=\"\",\"\",Input!$E$8)","v":""},{"$f":"IF($A$150=TRUE,D150,NA())","v":0},{"$f":"IF($A$150=TRUE,E150,NA())","v":{"$error":"#DIV/0!"}},{"$error":"#DIV/0!"},{"$error":"#DIV/0!"},{"$error":"#DIV/0!"},{"$error":"#DIV/0!"},{"$error":"#DIV/0!"},{"$error":"#DIV/0!"},{"$error":"#DIV/0!"},{"$error":"#DIV/0!"},{"$error":"#DIV/0!"},{"$error":"#DIV/0!"},{"$error":"#DIV/0!"},{"$error":"#DIV/0!"},{"$error":"#DIV/0!"},{"$error":"#DIV/0!"},{"$error":"#DIV/0!"},{"$error":"#DIV/0!"},{"$error":"#DIV/0!"},{"$error":"#DIV/0!"},{"$error":"#DIV/0!"},{"$error":"#DIV/0!"},{"$error":"#DIV/0!"},{"$error":"#DIV/0!"},{"$error":"#DIV/0!"},{"$f":"IF($A$150=TRUE,AC150,NA())","v":{"$error":"#DIV/0!"}}]
[true,null,null,{"$f":"D141","v":0},{"$f":"SUM($D$141:E141)","v":{"$error":"#DIV/0!"}},{"$f":"SUM($D$141:F141)","v":{"$error":"#DIV/0!"}},{"$f":"SUM($D$141:G141)","v":{"$error":"#DIV/0!"}},{"$f":"SUM($D$141:H141)","v":{"$error":"#DIV/0!"}},{"$f":"SUM($D$141:I141)","v":{"$error":"#DIV/0!"}},{"$f":"SUM($D$141:J141)","v":{"$error":"#DIV/0!"}},{"$f":"SUM($D$141:K141)","v":{"$error":"#DIV/0!"}},{"$f":"SUM($D$141:L141)","v":{"$error":"#DIV/0!"}},{"$f":"SUM($D$141:M141)","v":{"$error":"#DIV/0!"}},{"$f":"SUM($D$141:N141)","v":{"$error":"#DIV/0!"}},{"$f":"SUM($D$141:O141)","v":{"$error":"#DIV/0!"}},{"$f":"SUM($D$141:P141)","v":{"$error":"#DIV/0!"}},{"$f":"SUM($D$141:Q141)","v":{"$error":"#DIV/0!"}},{"$f":"SUM($D$141:R141)","v":{"$error":"#DIV/0!"}},{"$f":"SUM($D$141:S141)","v":{"$error":"#DIV/0!"}},{"$f":"SUM($D$141:T141)","v":{"$error":"#DIV/0!"}},{"$f":"SUM($D$141:U141)","v":{"$error":"#DIV/0!"}},{"$f":"SUM($D$141:V141)","v":{"$error":"#DIV/0!"}},{"$f":"SUM($D$141:W141)","v":{"$error":"#DIV/0!"}},{"$f":"SUM($D$141:X141)","v":{"$error":"#DIV/0!"}},{"$f":"SUM($D$141:Y141)","v":{"$error":"#DIV/0!"}},{"$f":"SUM($D$141:Z141)","v":{"$error":"#DIV/0!"}},{"$f":"SUM($D$141:AA141)","v":{"$error":"#DIV/0!"}},{"$f":"SUM($D$141:AB141)","v":{"$error":"#DIV/0!"}},{"$f":"SUM($D$141:AC141)","v":{"$error":"#DIV/0!"}}]
["Cost per water (m3)",null,null,{"$f":"D141/($B$8*365)","v":{"$error":"#DIV/0!"}},{"$f":"E141/($B$8*365)","v":{"$error":"#DIV/0!"}},{"$error":"#DIV/0!"},{"$error":"#DIV/0!"},{"$error":"#DIV/0!"},{"$error":"#DIV/0!"},{"$error":"#DIV/0!"},{"$error":"#DIV/0!"},{"$error":"#DIV/0!"},{"$error":"#DIV/0!"},{"$error":"#DIV/0!"},{"$error":"#DIV/0!"},{"$error":"#DIV/0!"},{"$error":"#DIV/0!"},{"$error":"#DIV/0!"},{"$error":"#DIV/0!"},{"$error":"#DIV/0!"},{"$error":"#DIV/0!"},{"$error":"#DIV/0!"},{"$error":"#DIV/0!"},{"$error":"#DIV/0!"},{"$error":"#DIV/0!"},{"$error":"#DIV/0!"},{"$error":"#DIV/0!"},{"$error":"#DIV/0!"},{"$error":"#DIV/0!"}]
[]
[]
["NPV",{"$f":"Input!E12","v":0},{"$f":"NPV(B154,E144:X144)+D144","v":{"$error":"#DIV/0!"}}]
["IRR",null,{"$f":"IRR(D144:X144)","v":{"$error":"#VALUE!"}}]
{"$rows_empty":24}
[{"$nulls":5},"Diagramms (Output) - Number:"]
[]
[]
[]
[{"$nulls":4},{"$f":"Output!A49","v":"Net Present Value (NPV)"},null,null,{"$f":"Output!A47","v":"Internal Rate of Return (IRR)"},null,null,{"$f":"Output!A53","v":"System Life Cycle Costs (25 years)"},null,null,{"$f":"Output!#REF!","v":{"$error":"#REF!"}},null,null,null,"Accumulated cash flow"]
[]
[{"$nulls":4},{"$f":"Input!D28","v":"Solar powered irrigation system costs"},{"$f":"C50","v":0},null,{"$f":"Input!D28","v":"Solar powered irrigation system costs"},{"$f":"C51","v":{"$error":"#NUM!"}},null,{"$f":"Input!D28","v":"Solar powered irrigation system costs"},{"$f":"B45","v":0},null,{"$f":"Input!D28","v":"Solar powered irrigation system costs"},{"$f":"B43","v":0},null,null,{"$f":"Input!D28","v":"Solar powered irrigation system costs"},{"$f":"AC40","v":0}]
[{"$nulls":4},{"$f":"Input!D57","v":"Grid powered irrigation system costs"},{"$f":"C88","v":{"$error":"#DIV/0!"}},null,{"$f":"Input!D57","v":"Grid powered irrigation system costs"},{"$f":"C89","v":{"$error":"#VALUE!"}},null,{"$f":"Input!D57","v":"Grid powered irrigation system costs"},{"$f":"B83","v":{"$error":"#DIV/0!"}},null,{"$f":"Input!D57","v":"Grid powered irrigation system costs"},{"$f":"B81","v":{"$error":"#DIV/0!"}},null,null,{"$f":"Input!D57","v":"Grid powered irrigation system costs"},{"$f":"AC78","v":{"$error":"#DIV/0!"}}]
[{"$nulls":4},{"$f":"Input!D89","v":"Diesel powered irrigation system costs"},{"$f":"C154","v":{"$error":"#DIV/0!"}},null,{"$f":"Input!D89","v":"Diesel powered irrigation system costs"},{"$f":"C155","v":{"$error":"#VALUE!"}},null,{"$f":"Input!D89","v":"Diesel powered irrigation system costs"},{"$f":"B149","v":{"$error":"#DIV/0!"}},null,{"$f":"Input!D89","v":"Diesel powered irrigation system costs"},{"$f":"B147","v":{"$error":"#DIV/0!"}},null,null,{"$f":"Input!D89","v":"Diesel powered irrigation system costs"},{"$f":"AC144","v":{"$error":"#DIV/0!"}}]
[{"$nulls":4},{"$f":"\" \" & Input!E8","v":" "},null,null,"%",null,null,{"$f":"\" \" & Input!E8","v":" "},null,null,{"$f":"\" \" & Input!E8","v":" "},{"$nulls":4},{"$f":"\" \" & Input!E8","v":" "}]
[{"$nulls":4},{"$f":"\"Irrigation system: comparative accumulated income and system costs over first 10 years in \" & E189","v":"Irrigation system: comparative accumulated income and system costs over first 10 years in  "}]
[{"$nulls":4},{"$f":"\"Irrigation system: comparative accumulated income and system costs over first 20 years in \" & E189","v":"Irrigation system: comparative accumulated income and system costs over first 20 years in  "}]
[{"$nulls":4},{"$f":"\"Irrigation system: comparative accumulated cash flow over first 10 years in \" & E189","v":"Irrigation system: comparative accumulated cash flow over first 10 years in  "}]
[{"$nulls":4},{"$f":"\"Irrigation system: comparative annual water cost (m³) over first 10 years in \" & E189","v":"Irrigation system: comparative annual water cost (m³) over first 10 years in  "}]
[{"$nulls":9},"Connections:"]
[{"$nulls":4},{"$f":"Input!D28","v":"Solar powered irrigation system costs"},{"$nulls":4},{"$f":"Input!E8 & \"/kWh\"","v":"/kWh"}]
[{"$nulls":4},{"$f":"Input!D57","v":"Grid powered irrigation system costs"},{"$nulls":4},{"$f":"Input!E8 & \"/l\"","v":"/l"}]

{"sheet":"Loan Repayment Solar","index":4,"n_rows":379,"n_cols":10,"rows_kept":379,"cut":false,"hidden":true,"merged":[[0,0,0,4],[0,5,0,9],[8,1,8,3],[8,5,8,7]]}
["Loan Repayment:",{"$nulls":4},{"$f":"Input!D28","v":"Solar powered irrigation system costs"}]
["Bank:",{"$f":"Input!E53","v":0}]
[]
[]
[]
[]
[]
[]
[null,"Enter Values",null,null,null,"Loan Summary"]
[null,null,"Loan Amount",{"$f":"Input!E50","v":0},null,null,"Scheduled Payment",{"$f":"IF(Values_Entered,-PMT(Interest_Rate/Num_Pmt_Per_Year,Loan_Years*Num_Pmt_Per_Year,Loan_Amount),\"0\")","v":"0"}]
[null,null,"Annual Interest Rate",{"$f":"Input!E51","v":0},null,null,"Scheduled Number of Payments",{"$f":"IF(Values_Entered,Loan_Years*Num_Pmt_Per_Year,\"\")","v":""}]
[null,null,"Loan Period in Years",{"$f":"Input!E52","v":0},null,null,"Actual Number of Payments",{"$f":"IF(Values_Entered,Number_of_Payments,\"\")","v":""}]
[null,null,"Number of Payments Per Year",1,null,null,"Total Early Payments",{"$f":"IF(Values_Entered,SUMIF(Beg_Bal,\">0\",Extra_Pay),\"\")","v":""}]
[null,null,"Start Date of Loan","2017-01-01",null,null,"Total Interest",{"$f":"IF(Values_Entered,SUMIF(Beg_Bal,\">0\",Int),\"\")","v":""}]
[null,null,"Optional Extra Payments",0]
[]
[]
["PmtNo.","Payment Date","Beginning Balance","Scheduled Payment","Extra Payment","Total Payment","Principal","Interest","Ending Balance","Cumulative Interest"]
[]
[{"$f":"IF(Values_Entered,1,\"\")","v":""},{"$f":"IF(Pay_Num<>\"\",DATE(YEAR(Loan_Start),MONTH(Loan_Start)+(Pay_Num)*12/Num_Pmt_Per_Year,DAY(Loan_Start)),\"\")","v":""},{"$f":"IF(Values_Entered,Loan_Amount,\"\")","v":""},{"$f":"IF(Pay_Num<>\"\",Scheduled_Monthly_Payment,\"\")","v":""},{"$f":"IF(AND(Pay_Num<>\"\",Sched_Pay+Scheduled_Extra_Payments<Beg_Bal),Scheduled_Extra_Payments,IF(AND(Pay_Num<>\"\",Beg_Bal-Sched_Pay>0),Beg_Bal-Sched_Pay,IF(Pay_Num<>\"\",0,\"\")))","v":{"$error":"#VALUE!"}},{"$f":"IF(AND(Pay_Num<>\"\",Sched_Pay+Extra_Pay<Beg_Bal),Sched_Pay+Extra_Pay,IF(Pay_Num<>\"\",Beg_Bal,\"\"))","v":{"$error":"#VALUE!"}},{"$f":"IF(Pay_Num<>\"\",Total_Pay-Int,\"\")","v":""},{"$f":"IF(Pay_Num<>\"\",Beg_Bal*(Interest_Rate/Num_Pmt_Per_Year),\"\")","v":""},{"$f":"IF(AND(Pay_Num<>\"\",Sched_Pay+Extra_Pay<Beg_Bal),Beg_Bal-Princ,IF(Pay_Num<>\"\",0,\"\"))","v":{"$error":"#VALUE!"}},{"$f":"SUM($H$20:$H20)","v":0}]
[{"$f":"IF(Values_Entered,A20+1,\"\")","v":""},"",{"$f":"IF(Pay_Num<>\"\",I20,\"\")","v":""},{"$f":"IF(Pay_Num<>\"\",Scheduled_Monthly_Payment,\"\")","v":""},{"$error":"#VALUE!"},{"$error":"#VALUE!"},{"$f":"IF(Pay_Num<>\"\",Total_Pay-Int,\"\")","v":""},{"$f":"IF(Pay_Num<>\"\",Beg_Bal*Interest_Rate/Num_Pmt_Per_Year,\"\")","v":""},{"$error":"#VALUE!"},{"$f":"SUM($H$20:$H21)","v":0}]
[{"$f":"IF(Values_Entered,A21+1,\"\")","v":""},"","",{"$f":"IF(Pay_Num<>\"\",Scheduled_Monthly_Payment,\"\")","v":""},{"$error":"#VALUE!"},{"$error":"#VALUE!"},"","",{"$error":"#VALUE!"},{"$f":"SUM($H$20:$H22)","v":0}]
[{"$f":"IF(Values_Entered,A22+1,\"\")","v":""},"","",{"$f":"IF(Pay_Num<>\"\",Scheduled_Monthly_Payment,\"\")","v":""},{"$error":"#VALUE!"},{"$error":"#VALUE!"},"","",{"$error":"#VALUE!"},{"$f":"SUM($H$20:$H23)","v":0}]
[{"$f":"IF(Values_Entered,A23+1,\"\")","v":""},"","","",{"$error":"#VALUE!"},{"$error":"#VALUE!"},"","",{"$error":"#VALUE!"},{"$f":"SUM($H$20:$H24)","v":0}]
[{"$f":"IF(Values_Entered,A24+1,\"\")","v":""},"","","",{"$error":"#VALUE!"},{"$error":"#VALUE!"},"","",{"$error":"#VALUE!"},{"$f":"SUM($H$20:$H25)","v":0}]
[{"$f":"IF(Values_Entered,A25+1,\"\")","v":""},"","","",{"$error":"#VALUE!"},{"$error":"#VALUE!"},"","",{"$error":"#VALUE!"},{"$f":"SUM($H$20:$H26)","v":0}]
[{"$f":"IF(Values_Entered,A26+1,\"\")","v":""},"","","",{"$error":"#VALUE!"},{"$error":"#VALUE!"},"","",{"$error":"#VALUE!"},{"$f":"SUM($H$20:$H27)","v":0}]
[{"$f":"IF(Values_Entered,A27+1,\"\")","v":""},"","","",{"$error":"#VALUE!"},{"$error":"#VALUE!"},"","",{"$error":"#VALUE!"},{"$f":"SUM($H$20:$H28)","v":0}]
[{"$f":"IF(Values_Entered,A28+1,\"\")","v":""},"","","",{"$error":"#VALUE!"},{"$error":"#VALUE!"},"","",{"$error":"#VALUE!"},{"$f":"SUM($H$20:$H29)","v":0}]
[{"$f":"IF(Values_Entered,A29+1,\"\")","v":""},"","","",{"$error":"#VALUE!"},{"$error":"#VALUE!"},"","",{"$error":"#VALUE!"},{"$f":"SUM($H$20:$H30)","v":0}]
[{"$f":"IF(Values_Entered,A30+1,\"\")","v":""},"","","",{"$error":"#VALUE!"},{"$error":"#VALUE!"},"","",{"$error":"#VALUE!"},{"$f":"SUM($H$20:$H31)","v":0}]
[{"$f":"IF(Values_Entered,A31+1,\"\")","v":""},"","","",{"$error":"#VALUE!"},{"$error":"#VALUE!"},"","",{"$error":"#VALUE!"},{"$f":"SUM($H$20:$H32)","v":0}]
[{"$f":"IF(Values_Entered,A32+1,\"\")","v":""},"","","",{"$error":"#VALUE!"},{"$error":"#VALUE!"},"","",{"$error":"#VALUE!"},{"$f":"SUM($H$20:$H33)","v":0}]
[{"$f":"IF(Values_Entered,A33+1,\"\")","v":""},"","","",{"$error":"#VALUE!"},{"$error":"#VALUE!"},"","",{"$error":"#VALUE!"},{"$f":"SUM($H$20:$H34)","v":0}]
[{"$f":"IF(Values_Entered,A34+1,\"\")","v":""},"","","",{"$error":"#VALUE!"},{"$error":"#VALUE!"},"","",{"$error":"#VALUE!"},{"$f":"SUM($H$20:$H35)","v":0}]
[{"$f":"IF(Values_Entered,A35+1,\"\")","v":""},"","","",{"$error":"#VALUE!"},{"$error":"#VALUE!"},"","",{"$error":"#VALUE!"},{"$f":"SUM($H$20:$H36)","v":0}]
[{"$f":"IF(Values_Entered,A36+1,\"\")","v":""},"","","",{"$error":"#VALUE!"},{"$error":"#VALUE!"},"","",{"$error":"#VALUE!"},{"$f":"SUM($H$20:$H37)","v":0}]
[{"$f":"IF(Values_Entered,A37+1,\"\")","v":""},"","","",{"$error":"#VALUE!"},{"$error":"#VALUE!"},"","",{"$error":"#VALUE!"},{"$f":"SUM($H$20:$H38)","v":0}]
[{"$f":"IF(Values_Entered,A38+1,\"\")","v":""},"","","",{"$error":"#VALUE!"},{"$error":"#VALUE!"},"","",{"$error":"#VALUE!"},{"$f":"SUM($H$20:$H39)","v":0}]
[{"$f":"IF(Values_Entered,A39+1,\"\")","v":""},"","","",{"$error":"#VALUE!"},{"$error":"#VALUE!"},"","",{"$error":"#VALUE!"},{"$f":"SUM($H$20:$H40)","v":0}]
[{"$f":"IF(Values_Entered,A40+1,\"\")","v":""},"","","",{"$error":"#VALUE!"},{"$error":"#VALUE!"},"","",{"$error":"#VALUE!"},{"$f":"SUM($H$20:$H41)","v":0}]
[{"$f":"IF(Values_Entered,A41+1,\"\")","v":""},"","","",{"$error":"#VALUE!"},{"$error":"#VALUE!"},"","",{"$error":"#VALUE!"},{"$f":"SUM($H$20:$H42)","v":0}]
[{"$f":"IF(Values_Entered,A42+1,\"\")","v":""},"","","",{"$error":"#VALUE!"},{"$error":"#VALUE!"},"","",{"$error":"#VALUE!"},{"$f":"SUM($H$20:$H43)","v":0}]
[{"$f":"IF(Values_Entered,A43+1,\"\")","v":""},"","","",{"$error":"#VALUE!"},{"$error":"#VALUE!"},"","",{"$error":"#VALUE!"},{"$f":"SUM($H$20:$H44)","v":0}]
[{"$f":"IF(Values_Entered,A44+1,\"\")","v":""},"","","",{"$error":"#VALUE!"},{"$error":"#VALUE!"},"","",{"$error":"#VALUE!"},{"$f":"SUM($H$20:$H45)","v":0}]
[{"$f":"IF(Values_Entered,A45+1,\"\")","v":""},"","","",{"$error":"#VALUE!"},{"$error":"#VALUE!"},"","",{"$error":"#VALUE!"},{"$f":"SUM($H$20:$H46)","v":0}]
[{"$f":"IF(Values_Entered,A46+1,\"\")","v":""},"","","",{"$error":"#VALUE!"},{"$error":"#VALUE!"},"","",{"$error":"#VALUE!"},{"$f":"SUM($H$20:$H47)","v":0}]
[{"$f":"IF(Values_Entered,A47+1,\"\")","v":""},"","","",{"$error":"#VALUE!"},{"$error":"#VALUE!"},"","",{"$error":"#VALUE!"},{"$f":"SUM($H$20:$H48)","v":0}]
[{"$f":"IF(Values_Entered,A48+1,\"\")","v":""},"","","",{"$error":"#VALUE!"},{"$error":"#VALUE!"},"","",{"$error":"#VALUE!"},{"$f":"SUM($H$20:$H49)","v":0}]
[{"$f":"IF(Values_Entered,A49+1,\"\")","v":""},"","","",{"$error":"#VALUE!"},{"$error":"#VALUE!"},"","",{"$error":"#VALUE!"},{"$f":"SUM($H$20:$H50)","v":0}]
[{"$f":"IF(Values_Entered,A50+1,\"\")","v":""},"","","",{"$error":"#VALUE!"},{"$error":"#VALUE!"},"","",{"$error":"#VALUE!"},{"$f":"SUM($H$20:$H51)","v":0}]
[{"$f":"IF(Values_Entered,A51+1,\"\")","v":""},"","","",{"$error":"#VALUE!"},{"$error":"#VALUE!"},"","",{"$error":"#VALUE!"},{"$f":"SUM($H$20:$H52)","v":0}]
[{"$f":"IF(Values_Entered,A52+1,\"\")","v":""},"","","",{"$error":"#VALUE!"},{"$error":"#VALUE!"},"","",{"$error":"#VALUE!"},{"$f":"SUM($H$20:$H53)","v":0}]
[{"$f":"IF(Values_Entered,A53+1,\"\")","v":""},"","","",{"$error":"#VALUE!"},{"$error":"#VALUE!"},"","",{"$error":"#VALUE!"},{"$f":"SUM($H$20:$H54)","v":0}]
[{"$f":"IF(Values_Entered,A54+1,\"\")","v":""},"","","",{"$error":"#VALUE!"},{"$error":"#VALUE!"},"","",{"$error":"#VALUE!"},{"$f":"SUM($H$20:$H55)","v":0}]
[{"$f":"IF(Values_Entered,A55+1,\"\")","v":""},"","","",{"$error":"#VALUE!"},{"$error":"#VALUE!"},"","",{"$error":"#VALUE!"},{"$f":"SUM($H$20:$H56)","v":0}]
[{"$f":"IF(Values_Entered,A56+1,\"\")","v":""},"","","",{"$error":"#VALUE!"},{"$error":"#VALUE!"},"","",{"$error":"#VALUE!"},{"$f":"SUM($H$20:$H57)","v":0}]
[{"$f":"IF(Values_Entered,A57+1,\"\")","v":""},"","","",{"$error":"#VALUE!"},{"$error":"#VALUE!"},"","",{"$error":"#VALUE!"},{"$f":"SUM($H$20:$H58)","v":0}]
[{"$f":"IF(Values_Entered,A58+1,\"\")","v":""},"","","",{"$error":"#VALUE!"},{"$error":"#VALUE!"},"","",{"$error":"#VALUE!"},{"$f":"SUM($H$20:$H59)","v":0}]
[{"$f":"IF(Values_Entered,A59+1,\"\")","v":""},"","","",{"$error":"#VALUE!"},{"$error":"#VALUE!"},"","",{"$error":"#VALUE!"},{"$f":"SUM($H$20:$H60)","v":0}]
[{"$f":"IF(Values_Entered,A60+1,\"\")","v":""},"","","",{"$error":"#VALUE!"},{"$error":"#VALUE!"},"","",{"$error":"#VALUE!"},{"$f":"SUM($H$20:$H61)","v":0}]
[{"$f":"IF(Values_Entered,A61+1,\"\")","v":""},"","","",{"$error":"#VALUE!"},{"$error":"#VALUE!"},"","",{"$error":"#VALUE!"},{"$f":"SUM($H$20:$H62)","v":0}]
[{"$f":"IF(Values_Entered,A62+1,\"\")","v":""},"","","",{"$error":"#VALUE!"},{"$error":"#VALUE!"},"","",{"$error":"#VALUE!"},{"$f":"SUM($H$20:$H63)","v":0}]
[{"$f":"IF(Values_Entered,A63+1,\"\")","v":""},"","","",{"$error":"#VALUE!"},{"$error":"#VALUE!"},"","",{"$error":"#VALUE!"},{"$f":"SUM($H$20:$H64)","v":0}]
[{"$f":"IF(Values_Entered,A64+1,\"\")","v":""},"","","",{"$error":"#VALUE!"},{"$error":"#VALUE!"},"","",{"$error":"#VALUE!"},{"$f":"SUM($H$20:$H65)","v":0}]
[{"$f":"IF(Values_Entered,A65+1,\"\")","v":""},"","","",{"$error":"#VALUE!"},{"$error":"#VALUE!"},"","",{"$error":"#VALUE!"},{"$f":"SUM($H$20:$H66)","v":0}]
[{"$f":"IF(Values_Entered,A66+1,\"\")","v":""},"","","",{"$error":"#VALUE!"},{"$error":"#VALUE!"},"","",{"$error":"#VALUE!"},{"$f":"SUM($H$20:$H67)","v":0}]
[{"$f":"IF(Values_Entered,A67+1,\"\")","v":""},"","","",{"$error":"#VALUE!"},{"$error":"#VALUE!"},"","",{"$error":"#VALUE!"},{"$f":"SUM($H$20:$H68)","v":0}]
[{"$f":"IF(Values_Entered,A68+1,\"\")","v":""},"","","",{"$error":"#VALUE!"},{"$error":"#VALUE!"},"","",{"$error":"#VALUE!"},{"$f":"SUM($H$20:$H69)","v":0}]
[{"$f":"IF(Values_Entered,A69+1,\"\")","v":""},"","","",{"$error":"#VALUE!"},{"$error":"#VALUE!"},"","",{"$error":"#VALUE!"},{"$f":"SUM($H$20:$H70)","v":0}]
[{"$f":"IF(Values_Entered,A70+1,\"\")","v":""},"","","",{"$error":"#VALUE!"},{"$error":"#VALUE!"},"","",{"$error":"#VALUE!"},{"$f":"SUM($H$20:$H71)","v":0}]
[{"$f":"IF(Values_Entered,A71+1,\"\")","v":""},"","","",{"$error":"#VALUE!"},{"$error":"#VALUE!"},"","",{"$error":"#VALUE!"},{"$f":"SUM($H$20:$H72)","v":0}]
[{"$f":"IF(Values_Entered,A72+1,\"\")","v":""},"","","",{"$error":"#VALUE!"},{"$error":"#VALUE!"},"","",{"$error":"#VALUE!"},{"$f":"SUM($H$20:$H73)","v":0}]
[{"$f":"IF(Values_Entered,A73+1,\"\")","v":""},"","","",{"$error":"#VALUE!"},{"$error":"#VALUE!"},"","",{"$error":"#VALUE!"},{"$f":"SUM($H$20:$H74)","v":0}]
[{"$f":"IF(Values_Entered,A74+1,\"\")","v":""},"","","",{"$error":"#VALUE!"},{"$error":"#VALUE!"},"","",{"$error":"#VALUE!"},{"$f":"SUM($H$20:$H75)","v":0}]
[{"$f":"IF(Values_Entered,A75+1,\"\")","v":""},"","","",{"$error":"#VALUE!"},{"$error":"#VALUE!"},"","",{"$error":"#VALUE!"},{"$f":"SUM($H$20:$H76)","v":0}]
[{"$f":"IF(Values_Entered,A76+1,\"\")","v":""},"","","",{"$error":"#VALUE!"},{"$error":"#VALUE!"},"","",{"$error":"#VALUE!"},{"$f":"SUM($H$20:$H77)","v":0}]
[{"$f":"IF(Values_Entered,A77+1,\"\")","v":""},"","","",{"$error":"#VALUE!"},{"$error":"#VALUE!"},"","",{"$error":"#VALUE!"},{"$f":"SUM($H$20:$H78)","v":0}]
[{"$f":"IF(Values_Entered,A78+1,\"\")","v":""},"","","",{"$error":"#VALUE!"},{"$error":"#VALUE!"},"","",{"$error":"#VALUE!"},{"$f":"SUM($H$20:$H79)","v":0}]
[{"$f":"IF(Values_Entered,A79+1,\"\")","v":""},"","","",{"$error":"#VALUE!"},{"$error":"#VALUE!"},"","",{"$error":"#VALUE!"},{"$f":"SUM($H$20:$H80)","v":0}]
[{"$f":"IF(Values_Entered,A80+1,\"\")","v":""},"","","",{"$error":"#VALUE!"},{"$error":"#VALUE!"},"","",{"$error":"#VALUE!"},{"$f":"SUM($H$20:$H81)","v":0}]
[{"$f":"IF(Values_Entered,A81+1,\"\")","v":""},"","","",{"$error":"#VALUE!"},{"$error":"#VALUE!"},"","",{"$error":"#VALUE!"},{"$f":"SUM($H$20:$H82)","v":0}]
[{"$f":"IF(Values_Entered,A82+1,\"\")","v":""},"","","",{"$error":"#VALUE!"},{"$error":"#VALUE!"},"","",{"$error":"#VALUE!"},{"$f":"SUM($H$20:$H83)","v":0}]
[{"$f":"IF(Values_Entered,A83+1,\"\")","v":""},{"$f":"IF(Pay_Num<>\"\",DATE(YEAR(Loan_Start),MONTH(Loan_Start)+(Pay_Num)*12/Num_Pmt_Per_Year,DAY(Loan_Start)),\"\")","v":""},"","",{"$f":"IF(AND(Pay_Num<>\"\",Sched_Pay+Scheduled_Extra_Payments<Beg_Bal),Scheduled_Extra_Payments,IF(AND(Pay_Num<>\"\",Beg_Bal-Sched_Pay>0),Beg_Bal-Sched_Pay,IF(Pay_Num<>\"\",0,\"\")))","v":{"$error":"#VALUE!"}},{"$f":"IF(AND(Pay_Num<>\"\",Sched_Pay+Extra_Pay<Beg_Bal),Sched_Pay+Extra_Pay,IF(Pay_Num<>\"\",Beg_Bal,\"\"))","v":{"$error":"#VALUE!"}},"","",{"$f":"IF(AND(Pay_Num<>\"\",Sched_Pay+Extra_Pay<Beg_Bal),Beg_Bal-Princ,IF(Pay_Num<>\"\",0,\"\"))","v":{"$error":"#VALUE!"}},{"$f":"SUM($H$20:$H84)","v":0}]
[{"$f":"IF(Values_Entered,A84+1,\"\")","v":""},"",{"$f":"IF(Pay_Num<>\"\",I84,\"\")","v":""},"",{"$error":"#VALUE!"},{"$error":"#VALUE!"},{"$f":"IF(Pay_Num<>\"\",Total_Pay-Int,\"\")","v":""},{"$f":"IF(Pay_Num<>\"\",Beg_Bal*Interest_Rate/Num_Pmt_Per_Year,\"\")","v":""},{"$error":"#VALUE!"},{"$f":"SUM($H$20:$H85)","v":0}]
[{"$f":"IF(Values_Entered,A85+1,\"\")","v":""},"","",{"$f":"IF(Pay_Num<>\"\",Scheduled_Monthly_Payment,\"\")","v":""},{"$error":"#VALUE!"},{"$error":"#VALUE!"},"","",{"$error":"#VALUE!"},{"$f":"SUM($H$20:$H86)","v":0}]
[{"$f":"IF(Values_Entered,A86+1,\"\")","v":""},"","","",{"$error":"#VALUE!"},{"$error":"#VALUE!"},"","",{"$error":"#VALUE!"},{"$f":"SUM($H$20:$H87)","v":0}]
[{"$f":"IF(Values_Entered,A87+1,\"\")","v":""},"","","",{"$error":"#VALUE!"},{"$error":"#VALUE!"},"","",{"$error":"#VALUE!"},{"$f":"SUM($H$20:$H88)","v":0}]
[{"$f":"IF(Values_Entered,A88+1,\"\")","v":""},"","","",{"$error":"#VALUE!"},{"$error":"#VALUE!"},"","",{"$error":"#VALUE!"},{"$f":"SUM($H$20:$H89)","v":0}]
[{"$f":"IF(Values_Entered,A89+1,\"\")","v":""},"","","",{"$error":"#VALUE!"},{"$error":"#VALUE!"},"","",{"$error":"#VALUE!"},{"$f":"SUM($H$20:$H90)","v":0}]
[{"$f":"IF(Values_Entered,A90+1,\"\")","v":""},"","","",{"$error":"#VALUE!"},{"$error":"#VALUE!"},"","",{"$error":"#VALUE!"},{"$f":"SUM($H$20:$H91)","v":0}]
[{"$f":"IF(Values_Entered,A91+1,\"\")","v":""},"","","",{"$error":"#VALUE!"},{"$error":"#VALUE!"},"","",{"$error":"#VALUE!"},{"$f":"SUM($H$20:$H92)","v":0}]
[{"$f":"IF(Values_Entered,A92+1,\"\")","v":""},"","","",{"$error":"#VALUE!"},{"$error":"#VALUE!"},"","",{"$error":"#VALUE!"},{"$f":"SUM($H$20:$H93)","v":0}]
[{"$f":"IF(Values_Entered,A93+1,\"\")","v":""},"","","",{"$error":"#VALUE!"},{"$error":"#VALUE!"},"","",{"$error":"#VALUE!"},{"$f":"SUM($H$20:$H94)","v":0}]
[{"$f":"IF(Values_Entered,A94+1,\"\")","v":""},"","","",{"$error":"#VALUE!"},{"$error":"#VALUE!"},"","",{"$error":"#VALUE!"},{"$f":"SUM($H$20:$H95)","v":0}]
[{"$f":"IF(Values_Entered,A95+1,\"\")","v":""},"","","",{"$error":"#VALUE!"},{"$error":"#VALUE!"},"","",{"$error":"#VALUE!"},{"$f":"SUM($H$20:$H96)","v":0}]
[{"$f":"IF(Values_Entered,A96+1,\"\")","v":""},"","","",{"$error":"#VALUE!"},{"$error":"#VALUE!"},"","",{"$error":"#VALUE!"},{"$f":"SUM($H$20:$H97)","v":0}]
[{"$f":"IF(Values_Entered,A97+1,\"\")","v":""},"","","",{"$error":"#VALUE!"},{"$error":"#VALUE!"},"","",{"$error":"#VALUE!"},{"$f":"SUM($H$20:$H98)","v":0}]
[{"$f":"IF(Values_Entered,A98+1,\"\")","v":""},"","","",{"$error":"#VALUE!"},{"$error":"#VALUE!"},"","",{"$error":"#VALUE!"},{"$f":"SUM($H$20:$H99)","v":0}]
[{"$f":"IF(Values_Entered,A99+1,\"\")","v":""},"","","",{"$error":"#VALUE!"},{"$error":"#VALUE!"},"","",{"$error":"#VALUE!"},{"$f":"SUM($H$20:$H100)","v":0}]
[{"$f":"IF(Values_Entered,A100+1,\"\")","v":""},"","","",{"$error":"#VALUE!"},{"$error":"#VALUE!"},"","",{"$error":"#VALUE!"},{"$f":"SUM($H$20:$H101)","v":0}]
[{"$f":"IF(Values_Entered,A101+1,\"\")","v":""},"","","",{"$error":"#VALUE!"},{"$error":"#VALUE!"},"","",{"$error":"#VALUE!"},{"$f":"SUM($H$20:$H102)","v":0}]
[{"$f":"IF(Values_Entered,A102+1,\"\")","v":""},"","","",{"$error":"#VALUE!"},{"$error":"#VALUE!"},"","",{"$error":"#VALUE!"},{"$f":"SUM($H$20:$H103)","v":0}]
[{"$f":"IF(Values_Entered,A103+1,\"\")","v":""},"","","",{"$error":"#VALUE!"},{"$error":"#VALUE!"},"","",{"$error":"#VALUE!"},{"$f":"SUM($H$20:$H104)","v":0}]
[{"$f":"IF(Values_Entered,A104+1,\"\")","v":""},"","","",{"$error":"#VALUE!"},{"$error":"#VALUE!"},"","",{"$error":"#VALUE!"},{"$f":"SUM($H$20:$H105)","v":0}]
[{"$f":"IF(Values_Entered,A105+1,\"\")","v":""},"","","",{"$error":"#VALUE!"},{"$error":"#VALUE!"},"","",{"$error":"#VALUE!"},{"$f":"SUM($H$20:$H106)","v":0}]
[{"$f":"IF(Values_Entered,A106+1,\"\")","v":""},"","","",{"$error":"#VALUE!"},{"$error":"#VALUE!"},"","",{"$error":"#VALUE!"},{"$f":"SUM($H$20:$H107)","v":0}]
[{"$f":"IF(Values_Entered,A107+1,\"\")","v":""},"","","",{"$error":"#VALUE!"},{"$error":"#VALUE!"},"","",{"$error":"#VALUE!"},{"$f":"SUM($H$20:$H108)","v":0}]
[{"$f":"IF(Values_Entered,A108+1,\"\")","v":""},"","","",{"$error":"#VALUE!"},{"$error":"#VALUE!"},"","",{"$error":"#VALUE!"},{"$f":"SUM($H$20:$H109)","v":0}]
[{"$f":"IF(Values_Entered,A109+1,\"\")","v":""},"","","",{"$error":"#VALUE!"},{"$error":"#VALUE!"},"","",{"$error":"#VALUE!"},{"$f":"SUM($H$20:$H110)","v":0}]
[{"$f":"IF(Values_Entered,A110+1,\"\")","v":""},"","","",{"$error":"#VALUE!"},{"$error":"#VALUE!"},"","",{"$error":"#VALUE!"},{"$f":"SUM($H$20:$H111)","v":0}]
[{"$f":"IF(Values_Entered,A111+1,\"\")","v":""},"","","",{"$error":"#VALUE!"},{"$error":"#VALUE!"},"","",{"$error":"#VALUE!"},{"$f":"SUM($H$20:$H112)","v":0}]
[{"$f":"IF(Values_Entered,A112+1,\"\")","v":""},"","","",{"$error":"#VALUE!"},{"$error":"#VALUE!"},"","",{"$error":"#VALUE!"},{"$f":"SUM($H$20:$H113)","v":0}]
[{"$f":"IF(Values_Entered,A113+1,\"\")","v":""},"","","",{"$error":"#VALUE!"},{"$error":"#VALUE!"},"","",{"$error":"#VALUE!"},{"$f":"SUM($H$20:$H114)","v":0}]
[{"$f":"IF(Values_Entered,A114+1,\"\")","v":""},"","","",{"$error":"#VALUE!"},{"$error":"#VALUE!"},"","",{"$error":"#VALUE!"},{"$f":"SUM($H$20:$H115)","v":0}]
[{"$f":"IF(Values_Entered,A115+1,\"\")","v":""},"","","",{"$error":"#VALUE!"},{"$error":"#VALUE!"},"","",{"$error":"#VALUE!"},{"$f":"SUM($H$20:$H116)","v":0}]
[{"$f":"IF(Values_Entered,A116+1,\"\")","v":""},"","","",{"$error":"#VALUE!"},{"$error":"#VALUE!"},"","",{"$error":"#VALUE!"},{"$f":"SUM($H$20:$H117)","v":0}]
[{"$f":"IF(Values_Entered,A117+1,\"\")","v":""},"","","",{"$error":"#VALUE!"},{"$error":"#VALUE!"},"","",{"$error":"#VALUE!"},{"$f":"SUM($H$20:$H118)","v":0}]
[{"$f":"IF(Values_Entered,A118+1,\"\")","v":""},"","","",{"$error":"#VALUE!"},{"$error":"#VALUE!"},"","",{"$error":"#VALUE!"},{"$f":"SUM($H$20:$H119)","v":0}]
[{"$f":"IF(Values_Entered,A119+1,\"\")","v":""},"","","",{"$error":"#VALUE!"},{"$error":"#VALUE!"},"","",{"$error":"#VALUE!"},{"$f":"SUM($H$20:$H120)","v":0}]
[{"$f":"IF(Values_Entered,A120+1,\"\")","v":""},"","","",{"$error":"#VALUE!"},{"$error":"#VALUE!"},"","",{"$error":"#VALUE!"},{"$f":"SUM($H$20:$H121)","v":0}]
[{"$f":"IF(Values_Entered,A121+1,\"\")","v":""},"","","",{"$error":"#VALUE!"},{"$error":"#VALUE!"},"","",{"$error":"#VALUE!"},{"$f":"SUM($H$20:$H122)","v":0}]
[{"$f":"IF(Values_Entered,A122+1,\"\")","v":""},"","","",{"$error":"#VALUE!"},{"$error":"#VALUE!"},"","",{"$error":"#VALUE!"},{"$f":"SUM($H$20:$H123)","v":0}]
[{"$f":"IF(Values_Entered,A123+1,\"\")","v":""},"","","",{"$error":"#VALUE!"},{"$error":"#VALUE!"},"","",{"$error":"#VALUE!"},{"$f":"SUM($H$20:$H124)","v":0}]
[{"$f":"IF(Values_Entered,A124+1,\"\")","v":""},"","","",{"$error":"#VALUE!"},{"$error":"#VALUE!"},"","",{"$error":"#VALUE!"},{"$f":"SUM($H$20:$H125)","v":0}]
[{"$f":"IF(Values_Entered,A125+1,\"\")","v":""},"","","",{"$error":"#VALUE!"},{"$error":"#VALUE!"},"","",{"$error":"#VALUE!"},{"$f":"SUM($H$20:$H126)","v":0}]
[{"$f":"IF(Values_Entered,A126+1,\"\")","v":""},"","","",{"$error":"#VALUE!"},{"$error":"#VALUE!"},"","",{"$error":"#VALUE!"},{"$f":"SUM($H$20:$H127)","v":0}]
[{"$f":"IF(Values_Entered,A127+1,\"\")","v":""},"","","",{"$error":"#VALUE!"},{"$error":"#VALUE!"},"","",{"$error":"#VALUE!"},{"$f":"SUM($H$20:$H128)","v":0}]
[{"$f":"IF(Values_Entered,A128+1,\"\")","v":""},"","","",{"$error":"#VALUE!"},{"$error":"#VALUE!"},"","",{"$error":"#VALUE!"},{"$f":"SUM($H$20:$H129)","v":0}]
[{"$f":"IF(Values_Entered,A129+1,\"\")","v":""},"","","",{"$error":"#VALUE!"},{"$error":"#VALUE!"},"","",{"$error":"#VALUE!"},{"$f":"SUM($H$20:$H130)","v":0}]
[{"$f":"IF(Values_Entered,A130+1,\"\")","v":""},"","","",{"$error":"#VALUE!"},{"$error":"#VALUE!"},"","",{"$error":"#VALUE!"},{"$f":"SUM($H$20:$H131)","v":0}]
[{"$f":"IF(Values_Entered,A131+1,\"\")","v":""},"","","",{"$error":"#VALUE!"},{"$error":"#VALUE!"},"","",{"$error":"#VALUE!"},{"$f":"SUM($H$20:$H132)","v":0}]
[{"$f":"IF(Values_Entered,A132+1,\"\")","v":""},"","","",{"$error":"#VALUE!"},{"$error":"#VALUE!"},"","",{"$error":"#VALUE!"},{"$f":"SUM($H$20:$H133)","v":0}]
[{"$f":"IF(Values_Entered,A133+1,\"\")","v":""},"","","",{"$error":"#VALUE!"},{"$error":"#VALUE!"},"","",{"$error":"#VALUE!"},{"$f":"SUM($H$20:$H134)","v":0}]
[{"$f":"IF(Values_Entered,A134+1,\"\")","v":""},"","","",{"$error":"#VALUE!"},{"$error":"#VALUE!"},"","",{"$error":"#VALUE!"},{"$f":"SUM($H$20:$H135)","v":0}]
[{"$f":"IF(Values_Entered,A135+1,\"\")","v":""},"","","",{"$error":"#VALUE!"},{"$error":"#VALUE!"},"","",{"$error":"#VALUE!"},{"$f":"SUM($H$20:$H136)","v":0}]
[{"$f":"IF(Values_Entered,A136+1,\"\")","v":""},"","","",{"$error":"#VALUE!"},{"$error":"#VALUE!"},"","",{"$error":"#VALUE!"},{"$f":"SUM($H$20:$H137)","v":0}]
[{"$f":"IF(Values_Entered,A137+1,\"\")","v":""},"","","",{"$error":"#VALUE!"},{"$error":"#VALUE!"},"","",{"$error":"#VALUE!"},{"$f":"SUM($H$20:$H138)","v":0}]
[{"$f":"IF(Values_Entered,A138+1,\"\")","v":""},"","","",{"$error":"#VALUE!"},{"$error":"#VALUE!"},"","",{"$error":"#VALUE!"},{"$f":"SUM($H$20:$H139)","v":0}]
[{"$f":"IF(Values_Entered,A139+1,\"\")","v":""},"","","",{"$error":"#VALUE!"},{"$error":"#VALUE!"},"","",{"$error":"#VALUE!"},{"$f":"SUM($H$20:$H140)","v":0}]
[{"$f":"IF(Values_Entered,A140+1,\"\")","v":""},"","","",{"$error":"#VALUE!"},{"$error":"#VALUE!"},"","",{"$error":"#VALUE!"},{"$f":"SUM($H$20:$H141)","v":0}]
[{"$f":"IF(Values_Entered,A141+1,\"\")","v":""},"","","",{"$error":"#VALUE!"},{"$error":"#VALUE!"},"","",{"$error":"#VALUE!"},{"$f":"SUM($H$20:$H142)","v":0}]
[{"$f":"IF(Values_Entered,A142+1,\"\")","v":""},"","","",{"$error":"#VALUE!"},{"$error":"#VALUE!"},"","",{"$error":"#VALUE!"},{"$f":"SUM($H$20:$H143)","v":0}]
[{"$f":"IF(Values_Entered,A143+1,\"\")","v":""},"","","",{"$error":"#VALUE!"},{"$error":"#VALUE!"},"","",{"$error":"#VALUE!"},{"$f":"SUM($H$20:$H144)","v":0}]
[{"$f":"IF(Values_Entered,A144+1,\"\")","v":""},"","","",{"$error":"#VALUE!"},{"$error":"#VALUE!"},"","",{"$error":"#VALUE!"},{"$f":"SUM($H$20:$H145)","v":0}]
[{"$f":"IF(Values_Entered,A145+1,\"\")","v":""},"","","",{"$error":"#VALUE!"},{"$error":"#VALUE!"},"","",{"$error":"#VALUE!"},{"$f":"SUM($H$20:$H146)","v":0}]
[{"$f":"IF(Values_Entered,A146+1,\"\")","v":""},"","","",{"$error":"#VALUE!"},{"$error":"#VALUE!"},"","",{"$error":"#VALUE!"},{"$f":"SUM($H$20:$H147)","v":0}]
[{"$f":"IF(Values_Entered,A147+1,\"\")","v":""},{"$f":"IF(Pay_Num<>\"\",DATE(YEAR(Loan_Start),MONTH(Loan_Start)+(Pay_Num)*12/Num_Pmt_Per_Year,DAY(Loan_Start)),\"\")","v":""},"","",{"$f":"IF(AND(Pay_Num<>\"\",Sched_Pay+Scheduled_Extra_Payments<Beg_Bal),Scheduled_Extra_Payments,IF(AND(Pay_Num<>\"\",Beg_Bal-Sched_Pay>0),Beg_Bal-Sched_Pay,IF(Pay_Num<>\"\",0,\"\")))","v":{"$error":"#VALUE!"}},{"$f":"IF(AND(Pay_Num<>\"\",Sched_Pay+Extra_Pay<Beg_Bal),Sched_Pay+Extra_Pay,IF(Pay_Num<>\"\",Beg_Bal,\"\"))","v":{"$error":"#VALUE!"}},"","",{"$f":"IF(AND(Pay_Num<>\"\",Sched_Pay+Extra_Pay<Beg_Bal),Beg_Bal-Princ,IF(Pay_Num<>\"\",0,\"\"))","v":{"$error":"#VALUE!"}},{"$f":"SUM($H$20:$H148)","v":0}]
[{"$f":"IF(Values_Entered,A148+1,\"\")","v":""},"",{"$f":"IF(Pay_Num<>\"\",I148,\"\")","v":""},"",{"$error":"#VALUE!"},{"$error":"#VALUE!"},{"$f":"IF(Pay_Num<>\"\",Total_Pay-Int,\"\")","v":""},{"$f":"IF(Pay_Num<>\"\",Beg_Bal*Interest_Rate/Num_Pmt_Per_Year,\"\")","v":""},{"$error":"#VALUE!"},{"$f":"SUM($H$20:$H149)","v":0}]
[{"$f":"IF(Values_Entered,A149+1,\"\")","v":""},"","",{"$f":"IF(Pay_Num<>\"\",Scheduled_Monthly_Payment,\"\")","v":""},{"$error":"#VALUE!"},{"$error":"#VALUE!"},"","",{"$error":"#VALUE!"},{"$f":"SUM($H$20:$H150)","v":0}]
[{"$f":"IF(Values_Entered,A150+1,\"\")","v":""},"","","",{"$error":"#VALUE!"},{"$error":"#VALUE!"},"","",{"$error":"#VALUE!"},{"$f":"SUM($H$20:$H151)","v":0}]
[{"$f":"IF(Values_Entered,A151+1,\"\")","v":""},"","","",{"$error":"#VALUE!"},{"$error":"#VALUE!"},"","",{"$error":"#VALUE!"},{"$f":"SUM($H$20:$H152)","v":0}]
[{"$f":"IF(Values_Entered,A152+1,\"\")","v":""},"","","",{"$error":"#VALUE!"},{"$error":"#VALUE!"},"","",{"$error":"#VALUE!"},{"$f":"SUM($H$20:$H153)","v":0}]
[{"$f":"IF(Values_Entered,A153+1,\"\")","v":""},"","","",{"$error":"#VALUE!"},{"$error":"#VALUE!"},"","",{"$error":"#VALUE!"},{"$f":"SUM($H$20:$H154)","v":0}]
[{"$f":"IF(Values_Entered,A154+1,\"\")","v":""},"","","",{"$error":"#VALUE!"},{"$error":"#VALUE!"},"","",{"$error":"#VALUE!"},{"$f":"SUM($H$20:$H155)","v":0}]
[{"$f":"IF(Values_Entered,A155+1,\"\")","v":""},"","","",{"$error":"#VALUE!"},{"$error":"#VALUE!"},"","",{"$error":"#VALUE!"},{"$f":"SUM($H$20:$H156)","v":0}]
[{"$f":"IF(Values_Entered,A156+1,\"\")","v":""},"","","",{"$error":"#VALUE!"},{"$error":"#VALUE!"},"","",{"$error":"#VALUE!"},{"$f":"SUM($H$20:$H157)","v":0}]
[{"$f":"IF(Values_Entered,A157+1,\"\")","v":""},"","","",{"$error":"#VALUE!"},{"$error":"#VALUE!"},"","",{"$error":"#VALUE!"},{"$f":"SUM($H$20:$H158)","v":0}]
[{"$f":"IF(Values_Entered,A158+1,\"\")","v":""},"","","",{"$error":"#VALUE!"},{"$error":"#VALUE!"},"","",{"$error":"#VALUE!"},{"$f":"SUM($H$20:$H159)","v":0}]
[{"$f":"IF(Values_Entered,A159+1,\"\")","v":""},"","","",{"$error":"#VALUE!"},{"$error":"#VALUE!"},"","",{"$error":"#VALUE!"},{"$f":"SUM($H$20:$H160)","v":0}]
[{"$f":"IF(Values_Entered,A160+1,\"\")","v":""},"","","",{"$error":"#VALUE!"},{"$error":"#VALUE!"},"","",{"$error":"#VALUE!"},{"$f":"SUM($H$20:$H161)","v":0}]
[{"$f":"IF(Values_Entered,A161+1,\"\")","v":""},"","","",{"$error":"#VALUE!"},{"$error":"#VALUE!"},"","",{"$error":"#VALUE!"},{"$f":"SUM($H$20:$H162)","v":0}]
[{"$f":"IF(Values_Entered,A162+1,\"\")","v":""},"","","",{"$error":"#VALUE!"},{"$error":"#VALUE!"},"","",{"$error":"#VALUE!"},{"$f":"SUM($H$20:$H163)","v":0}]
[{"$f":"IF(Values_Entered,A163+1,\"\")","v":""},"","","",{"$error":"#VALUE!"},{"$error":"#VALUE!"},"","",{"$error":"#VALUE!"},{"$f":"SUM($H$20:$H164)","v":0}]
[{"$f":"IF(Values_Entered,A164+1,\"\")","v":""},"","","",{"$error":"#VALUE!"},{"$error":"#VALUE!"},"","",{"$error":"#VALUE!"},{"$f":"SUM($H$20:$H165)","v":0}]
[{"$f":"IF(Values_Entered,A165+1,\"\")","v":""},"","","",{"$error":"#VALUE!"},{"$error":"#VALUE!"},"","",{"$error":"#VALUE!"},{"$f":"SUM($H$20:$H166)","v":0}]
[{"$f":"IF(Values_Entered,A166+1,\"\")","v":""},"","","",{"$error":"#VALUE!"},{"$error":"#VALUE!"},"","",{"$error":"#VALUE!"},{"$f":"SUM($H$20:$H167)","v":0}]
[{"$f":"IF(Values_Entered,A167+1,\"\")","v":""},"","","",{"$error":"#VALUE!"},{"$error":"#VALUE!"},"","",{"$error":"#VALUE!"},{"$f":"SUM($H$20:$H168)","v":0}]
[{"$f":"IF(Values_Entered,A168+1,\"\")","v":""},"","","",{"$error":"#VALUE!"},{"$error":"#VALUE!"},"","",{"$error":"#VALUE!"},{"$f":"SUM($H$20:$H169)","v":0}]
[{"$f":"IF(Values_Entered,A169+1,\"\")","v":""},"","","",{"$error":"#VALUE!"},{"$error":"#VALUE!"},"","",{"$error":"#VALUE!"},{"$f":"SUM($H$20:$H170)","v":0}]
[{"$f":"IF(Values_Entered,A170+1,\"\")","v":""},"","","",{"$error":"#VALUE!"},{"$error":"#VALUE!"},"","",{"$error":"#VALUE!"},{"$f":"SUM($H$20:$H171)","v":0}]
[{"$f":"IF(Values_Entered,A171+1,\"\")","v":""},"","","",{"$error":"#VALUE!"},{"$error":"#VALUE!"},"","",{"$error":"#VALUE!"},{"$f":"SUM($H$20:$H172)","v":0}]
[{"$f":"IF(Values_Entered,A172+1,\"\")","v":""},"","","",{"$error":"#VALUE!"},{"$error":"#VALUE!"},"","",{"$error":"#VALUE!"},{"$f":"SUM($H$20:$H173)","v":0}]
[{"$f":"IF(Values_Entered,A173+1,\"\")","v":""},"","","",{"$error":"#VALUE!"},{"$error":"#VALUE!"},"","",{"$error":"#VALUE!"},{"$f":"SUM($H$20:$H174)","v":0}]
[{"$f":"IF(Values_Entered,A174+1,\"\")","v":""},"","","",{"$error":"#VALUE!"},{"$error":"#VALUE!"},"","",{"$error":"#VALUE!"},{"$f":"SUM($H$20:$H175)","v":0}]
[{"$f":"IF(Values_Entered,A175+1,\"\")","v":""},"","","",{"$error":"#VALUE!"},{"$error":"#VALUE!"},"","",{"$error":"#VALUE!"},{"$f":"SUM($H$20:$H176)","v":0}]
[{"$f":"IF(Values_Entered,A176+1,\"\")","v":""},"","","",{"$error":"#VALUE!"},{"$error":"#VALUE!"},"","",{"$error":"#VALUE!"},{"$f":"SUM($H$20:$H177)","v":0}]
[{"$f":"IF(Values_Entered,A177+1,\"\")","v":""},"","","",{"$error":"#VALUE!"},{"$error":"#VALUE!"},"","",{"$error":"#VALUE!"},{"$f":"SUM($H$20:$H178)","v":0}]
[{"$f":"IF(Values_Entered,A178+1,\"\")","v":""},"","","",{"$error":"#VALUE!"},{"$error":"#VALUE!"},"","",{"$error":"#VALUE!"},{"$f":"SUM($H$20:$H179)","v":0}]
[{"$f":"IF(Values_Entered,A179+1,\"\")","v":""},"","","",{"$error":"#VALUE!"},{"$error":"#VALUE!"},"","",{"$error":"#VALUE!"},{"$f":"SUM($H$20:$H180)","v":0}]
[{"$f":"IF(Values_Entered,A180+1,\"\")","v":""},"","","",{"$error":"#VALUE!"},{"$error":"#VALUE!"},"","",{"$error":"#VALUE!"},{"$f":"SUM($H$20:$H181)","v":0}]
[{"$f":"IF(Values_Entered,A181+1,\"\")","v":""},"","","",{"$error":"#VALUE!"},{"$error":"#VALUE!"},"","",{"$error":"#VALUE!"},{"$f":"SUM($H$20:$H182)","v":0}]
[{"$f":"IF(Values_Entered,A182+1,\"\")","v":""},"","","",{"$error":"#VALUE!"},{"$error":"#VALUE!"},"","",{"$error":"#VALUE!"},{"$f":"SUM($H$20:$H183)","v":0}]
[{"$f":"IF(Values_Entered,A183+1,\"\")","v":""},"","","",{"$error":"#VALUE!"},{"$error":"#VALUE!"},"","",{"$error":"#VALUE!"},{"$f":"SUM($H$20:$H184)","v":0}]
[{"$f":"IF(Values_Entered,A184+1,\"\")","v":""},"","","",{"$error":"#VALUE!"},{"$error":"#VALUE!"},"","",{"$error":"#VALUE!"},{"$f":"SUM($H$20:$H185)","v":0}]
[{"$f":"IF(Values_Entered,A185+1,\"\")","v":""},"","","",{"$error":"#VALUE!"},{"$error":"#VALUE!"},"","",{"$error":"#VALUE!"},{"$f":"SUM($H$20:$H186)","v":0}]
[{"$f":"IF(Values_Entered,A186+1,\"\")","v":""},"","","",{"$error":"#VALUE!"},{"$error":"#VALUE!"},"","",{"$error":"#VALUE!"},{"$f":"SUM($H$20:$H187)","v":0}]
[{"$f":"IF(Values_Entered,A187+1,\"\")","v":""},"","","",{"$error":"#VALUE!"},{"$error":"#VALUE!"},"","",{"$error":"#VALUE!"},{"$f":"SUM($H$20:$H188)","v":0}]
[{"$f":"IF(Values_Entered,A188+1,\"\")","v":""},"","","",{"$error":"#VALUE!"},{"$error":"#VALUE!"},"","",{"$error":"#VALUE!"},{"$f":"SUM($H$20:$H189)","v":0}]
[{"$f":"IF(Values_Entered,A189+1,\"\")","v":""},"","","",{"$error":"#VALUE!"},{"$error":"#VALUE!"},"","",{"$error":"#VALUE!"},{"$f":"SUM($H$20:$H190)","v":0}]
[{"$f":"IF(Values_Entered,A190+1,\"\")","v":""},"","","",{"$error":"#VALUE!"},{"$error":"#VALUE!"},"","",{"$error":"#VALUE!"},{"$f":"SUM($H$20:$H191)","v":0}]
[{"$f":"IF(Values_Entered,A191+1,\"\")","v":""},"","","",{"$error":"#VALUE!"},{"$error":"#VALUE!"},"","",{"$error":"#VALUE!"},{"$f":"SUM($H$20:$H192)","v":0}]
[{"$f":"IF(Values_Entered,A192+1,\"\")","v":""},"","","",{"$error":"#VALUE!"},{"$error":"#VALUE!"},"","",{"$error":"#VALUE!"},{"$f":"SUM($H$20:$H193)","v":0}]
[{"$f":"IF(Values_Entered,A193+1,\"\")","v":""},"","","",{"$error":"#VALUE!"},{"$error":"#VALUE!"},"","",{"$error":"#VALUE!"},{"$f":"SUM($H$20:$H194)","v":0}]
[{"$f":"IF(Values_Entered,A194+1,\"\")","v":""},"","","",{"$error":"#VALUE!"},{"$error":"#VALUE!"},"","",{"$error":"#VALUE!"},{"$f":"SUM($H$20:$H195)","v":0}]
[{"$f":"IF(Values_Entered,A195+1,\"\")","v":""},"","","",{"$error":"#VALUE!"},{"$error":"#VALUE!"},"","",{"$error":"#VALUE!"},{"$f":"SUM($H$20:$H196)","v":0}]
[{"$f":"IF(Values_Entered,A196+1,\"\")","v":""},"","","",{"$error":"#VALUE!"},{"$error":"#VALUE!"},"","",{"$error":"#VALUE!"},{"$f":"SUM($H$20:$H197)","v":0}]
[{"$f":"IF(Values_Entered,A197+1,\"\")","v":""},"","","",{"$error":"#VALUE!"},{"$error":"#VALUE!"},"","",{"$error":"#VALUE!"},{"$f":"SUM($H$20:$H198)","v":0}]
[{"$f":"IF(Values_Entered,A198+1,\"\")","v":""},"","","",{"$error":"#VALUE!"},{"$error":"#VALUE!"},"","",{"$error":"#VALUE!"},{"$f":"SUM($H$20:$H199)","v":0}]
[{"$f":"IF(Values_Entered,A199+1,\"\")","v":""},"","","",{"$error":"#VALUE!"},{"$error":"#VALUE!"},"","",{"$error":"#VALUE!"},{"$f":"SUM($H$20:$H200)","v":0}]
[{"$f":"IF(Values_Entered,A200+1,\"\")","v":""},"","","",{"$error":"#VALUE!"},{"$error":"#VALUE!"},"","",{"$error":"#VALUE!"},{"$f":"SUM($H$20:$H201)","v":0}]
[{"$f":"IF(Values_Entered,A201+1,\"\")","v":""},"","","",{"$error":"#VALUE!"},{"$error":"#VALUE!"},"","",{"$error":"#VALUE!"},{"$f":"SUM($H$20:$H202)","v":0}]
[{"$f":"IF(Values_Entered,A202+1,\"\")","v":""},"","","",{"$error":"#VALUE!"},{"$error":"#VALUE!"},"","",{"$error":"#VALUE!"},{"$f":"SUM($H$20:$H203)","v":0}]
[{"$f":"IF(Values_Entered,A203+1,\"\")","v":""},"","","",{"$error":"#VALUE!"},{"$error":"#VALUE!"},"","",{"$error":"#VALUE!"},{"$f":"SUM($H$20:$H204)","v":0}]
[{"$f":"IF(Values_Entered,A204+1,\"\")","v":""},"","","",{"$error":"#VALUE!"},{"$error":"#VALUE!"},"","",{"$error":"#VALUE!"},{"$f":"SUM($H$20:$H205)","v":0}]
[{"$f":"IF(Values_Entered,A205+1,\"\")","v":""},"","","",{"$error":"#VALUE!"},{"$error":"#VALUE!"},"","",{"$error":"#VALUE!"},{"$f":"SUM($H$20:$H206)","v":0}]
[{"$f":"IF(Values_Entered,A206+1,\"\")","v":""},"","","",{"$error":"#VALUE!"},{"$error":"#VALUE!"},"","",{"$error":"#VALUE!"},{"$f":"SUM($H$20:$H207)","v":0}]
[{"$f":"IF(Values_Entered,A207+1,\"\")","v":""},"","","",{"$error":"#VALUE!"},{"$error":"#VALUE!"},"","",{"$error":"#VALUE!"},{"$f":"SUM($H$20:$H208)","v":0}]
[{"$f":"IF(Values_Entered,A208+1,\"\")","v":""},"","","",{"$error":"#VALUE!"},{"$error":"#VALUE!"},"","",{"$error":"#VALUE!"},{"$f":"SUM($H$20:$H209)","v":0}]
[{"$f":"IF(Values_Entered,A209+1,\"\")","v":""},"","","",{"$error":"#VALUE!"},{"$error":"#VALUE!"},"","",{"$error":"#VALUE!"},{"$f":"SUM($H$20:$H210)","v":0}]
[{"$f":"IF(Values_Entered,A210+1,\"\")","v":""},"","","",{"$error":"#VALUE!"},{"$error":"#VALUE!"},"","",{"$error":"#VALUE!"},{"$f":"SUM($H$20:$H211)","v":0}]
[{"$f":"IF(Values_Entered,A211+1,\"\")","v":""},{"$f":"IF(Pay_Num<>\"\",DATE(YEAR(Loan_Start),MONTH(Loan_Start)+(Pay_Num)*12/Num_Pmt_Per_Year,DAY(Loan_Start)),\"\")","v":""},"","",{"$f":"IF(AND(Pay_Num<>\"\",Sched_Pay+Scheduled_Extra_Payments<Beg_Bal),Scheduled_Extra_Payments,IF(AND(Pay_Num<>\"\",Beg_Bal-Sched_Pay>0),Beg_Bal-Sched_Pay,IF(Pay_Num<>\"\",0,\"\")))","v":{"$error":"#VALUE!"}},{"$f":"IF(AND(Pay_Num<>\"\",Sched_Pay+Extra_Pay<Beg_Bal),Sched_Pay+Extra_Pay,IF(Pay_Num<>\"\",Beg_Bal,\"\"))","v":{"$error":"#VALUE!"}},"","",{"$f":"IF(AND(Pay_Num<>\"\",Sched_Pay+Extra_Pay<Beg_Bal),Beg_Bal-Princ,IF(Pay_Num<>\"\",0,\"\"))","v":{"$error":"#VALUE!"}},{"$f":"SUM($H$20:$H212)","v":0}]
[{"$f":"IF(Values_Entered,A212+1,\"\")","v":""},"",{"$f":"IF(Pay_Num<>\"\",I212,\"\")","v":""},"",{"$error":"#VALUE!"},{"$error":"#VALUE!"},{"$f":"IF(Pay_Num<>\"\",Total_Pay-Int,\"\")","v":""},{"$f":"IF(Pay_Num<>\"\",Beg_Bal*Interest_Rate/Num_Pmt_Per_Year,\"\")","v":""},{"$error":"#VALUE!"},{"$f":"SUM($H$20:$H213)","v":0}]
[{"$f":"IF(Values_Entered,A213+1,\"\")","v":""},"","",{"$f":"IF(Pay_Num<>\"\",Scheduled_Monthly_Payment,\"\")","v":""},{"$error":"#VALUE!"},{"$error":"#VALUE!"},"","",{"$error":"#VALUE!"},{"$f":"SUM($H$20:$H214)","v":0}]
[{"$f":"IF(Values_Entered,A214+1,\"\")","v":""},"","","",{"$error":"#VALUE!"},{"$error":"#VALUE!"},"","",{"$error":"#VALUE!"},{"$f":"SUM($H$20:$H215)","v":0}]
[{"$f":"IF(Values_Entered,A215+1,\"\")","v":""},"","","",{"$error":"#VALUE!"},{"$error":"#VALUE!"},"","",{"$error":"#VALUE!"},{"$f":"SUM($H$20:$H216)","v":0}]
[{"$f":"IF(Values_Entered,A216+1,\"\")","v":""},"","","",{"$error":"#VALUE!"},{"$error":"#VALUE!"},"","",{"$error":"#VALUE!"},{"$f":"SUM($H$20:$H217)","v":0}]
[{"$f":"IF(Values_Entered,A217+1,\"\")","v":""},"","","",{"$error":"#VALUE!"},{"$error":"#VALUE!"},"","",{"$error":"#VALUE!"},{"$f":"SUM($H$20:$H218)","v":0}]
[{"$f":"IF(Values_Entered,A218+1,\"\")","v":""},"","","",{"$error":"#VALUE!"},{"$error":"#VALUE!"},"","",{"$error":"#VALUE!"},{"$f":"SUM($H$20:$H219)","v":0}]
[{"$f":"IF(Values_Entered,A219+1,\"\")","v":""},"","","",{"$error":"#VALUE!"},{"$error":"#VALUE!"},"","",{"$error":"#VALUE!"},{"$f":"SUM($H$20:$H220)","v":0}]
[{"$f":"IF(Values_Entered,A220+1,\"\")","v":""},"","","",{"$error":"#VALUE!"},{"$error":"#VALUE!"},"","",{"$error":"#VALUE!"},{"$f":"SUM($H$20:$H221)","v":0}]
[{"$f":"IF(Values_Entered,A221+1,\"\")","v":""},"","","",{"$error":"#VALUE!"},{"$error":"#VALUE!"},"","",{"$error":"#VALUE!"},{"$f":"SUM($H$20:$H222)","v":0}]
[{"$f":"IF(Values_Entered,A222+1,\"\")","v":""},"","","",{"$error":"#VALUE!"},{"$error":"#VALUE!"},"","",{"$error":"#VALUE!"},{"$f":"SUM($H$20:$H223)","v":0}]
[{"$f":"IF(Values_Entered,A223+1,\"\")","v":""},"","","",{"$error":"#VALUE!"},{"$error":"#VALUE!"},"","",{"$error":"#VALUE!"},{"$f":"SUM($H$20:$H224)","v":0}]
[{"$f":"IF(Values_Entered,A224+1,\"\")","v":""},"","","",{"$error":"#VALUE!"},{"$error":"#VALUE!"},"","",{"$error":"#VALUE!"},{"$f":"SUM($H$20:$H225)","v":0}]
[{"$f":"IF(Values_Entered,A225+1,\"\")","v":""},"","","",{"$error":"#VALUE!"},{"$error":"#VALUE!"},"","",{"$error":"#VALUE!"},{"$f":"SUM($H$20:$H226)","v":0}]
[{"$f":"IF(Values_Entered,A226+1,\"\")","v":""},"","","",{"$error":"#VALUE!"},{"$error":"#VALUE!"},"","",{"$error":"#VALUE!"},{"$f":"SUM($H$20:$H227)","v":0}]
[{"$f":"IF(Values_Entered,A227+1,\"\")","v":""},"","","",{"$error":"#VALUE!"},{"$error":"#VALUE!"},"","",{"$error":"#VALUE!"},{"$f":"SUM($H$20:$H228)","v":0}]
[{"$f":"IF(Values_Entered,A228+1,\"\")","v":""},"","","",{"$error":"#VALUE!"},{"$error":"#VALUE!"},"","",{"$error":"#VALUE!"},{"$f":"SUM($H$20:$H229)","v":0}]
[{"$f":"IF(Values_Entered,A229+1,\"\")","v":""},"","","",{"$error":"#VALUE!"},{"$error":"#VALUE!"},"","",{"$error":"#VALUE!"},{"$f":"SUM($H$20:$H230)","v":0}]
[{"$f":"IF(Values_Entered,A230+1,\"\")","v":""},"","","",{"$error":"#VALUE!"},{"$error":"#VALUE!"},"","",{"$error":"#VALUE!"},{"$f":"SUM($H$20:$H231)","v":0}]
[{"$f":"IF(Values_Entered,A231+1,\"\")","v":""},"","","",{"$error":"#VALUE!"},{"$error":"#VALUE!"},"","",{"$error":"#VALUE!"},{"$f":"SUM($H$20:$H232)","v":0}]
[{"$f":"IF(Values_Entered,A232+1,\"\")","v":""},"","","",{"$error":"#VALUE!"},{"$error":"#VALUE!"},"","",{"$error":"#VALUE!"},{"$f":"SUM($H$20:$H233)","v":0}]
[{"$f":"IF(Values_Entered,A233+1,\"\")","v":""},"","","",{"$error":"#VALUE!"},{"$error":"#VALUE!"},"","",{"$error":"#VALUE!"},{"$f":"SUM($H$20:$H234)","v":0}]
[{"$f":"IF(Values_Entered,A234+1,\"\")","v":""},"","","",{"$error":"#VALUE!"},{"$error":"#VALUE!"},"","",{"$error":"#VALUE!"},{"$f":"SUM($H$20:$H235)","v":0}]
[{"$f":"IF(Values_Entered,A235+1,\"\")","v":""},"","","",{"$error":"#VALUE!"},{"$error":"#VALUE!"},"","",{"$error":"#VALUE!"},{"$f":"SUM($H$20:$H236)","v":0}]
[{"$f":"IF(Values_Entered,A236+1,\"\")","v":""},"","","",{"$error":"#VALUE!"},{"$error":"#VALUE!"},"","",{"$error":"#VALUE!"},{"$f":"SUM($H$20:$H237)","v":0}]
[{"$f":"IF(Values_Entered,A237+1,\"\")","v":""},"","","",{"$error":"#VALUE!"},{"$error":"#VALUE!"},"","",{"$error":"#VALUE!"},{"$f":"SUM($H$20:$H238)","v":0}]
[{"$f":"IF(Values_Entered,A238+1,\"\")","v":""},"","","",{"$error":"#VALUE!"},{"$error":"#VALUE!"},"","",{"$error":"#VALUE!"},{"$f":"SUM($H$20:$H239)","v":0}]
[{"$f":"IF(Values_Entered,A239+1,\"\")","v":""},"","","",{"$error":"#VALUE!"},{"$error":"#VALUE!"},"","",{"$error":"#VALUE!"},{"$f":"SUM($H$20:$H240)","v":0}]
[{"$f":"IF(Values_Entered,A240+1,\"\")","v":""},"","","",{"$error":"#VALUE!"},{"$error":"#VALUE!"},"","",{"$error":"#VALUE!"},{"$f":"SUM($H$20:$H241)","v":0}]
[{"$f":"IF(Values_Entered,A241+1,\"\")","v":""},"","","",{"$error":"#VALUE!"},{"$error":"#VALUE!"},"","",{"$error":"#VALUE!"},{"$f":"SUM($H$20:$H242)","v":0}]
[{"$f":"IF(Values_Entered,A242+1,\"\")","v":""},"","","",{"$error":"#VALUE!"},{"$error":"#VALUE!"},"","",{"$error":"#VALUE!"},{"$f":"SUM($H$20:$H243)","v":0}]
[{"$f":"IF(Values_Entered,A243+1,\"\")","v":""},"","","",{"$error":"#VALUE!"},{"$error":"#VALUE!"},"","",{"$error":"#VALUE!"},{"$f":"SUM($H$20:$H244)","v":0}]
[{"$f":"IF(Values_Entered,A244+1,\"\")","v":""},"","","",{"$error":"#VALUE!"},{"$error":"#VALUE!"},"","",{"$error":"#VALUE!"},{"$f":"SUM($H$20:$H245)","v":0}]
[{"$f":"IF(Values_Entered,A245+1,\"\")","v":""},"","","",{"$error":"#VALUE!"},{"$error":"#VALUE!"},"","",{"$error":"#VALUE!"},{"$f":"SUM($H$20:$H246)","v":0}]
[{"$f":"IF(Values_Entered,A246+1,\"\")","v":""},"","","",{"$error":"#VALUE!"},{"$error":"#VALUE!"},"","",{"$error":"#VALUE!"},{"$f":"SUM($H$20:$H247)","v":0}]
[{"$f":"IF(Values_Entered,A247+1,\"\")","v":""},"","","",{"$error":"#VALUE!"},{"$error":"#VALUE!"},"","",{"$error":"#VALUE!"},{"$f":"SUM($H$20:$H248)","v":0}]
[{"$f":"IF(Values_Entered,A248+1,\"\")","v":""},"","","",{"$error":"#VALUE!"},{"$error":"#VALUE!"},"","",{"$error":"#VALUE!"},{"$f":"SUM($H$20:$H249)","v":0}]
[{"$f":"IF(Values_Entered,A249+1,\"\")","v":""},"","","",{"$error":"#VALUE!"},{"$error":"#VALUE!"},"","",{"$error":"#VALUE!"},{"$f":"SUM($H$20:$H250)","v":0}]
[{"$f":"IF(Values_Entered,A250+1,\"\")","v":""},"","","",{"$error":"#VALUE!"},{"$error":"#VALUE!"},"","",{"$error":"#VALUE!"},{"$f":"SUM($H$20:$H251)","v":0}]
[{"$f":"IF(Values_Entered,A251+1,\"\")","v":""},"","","",{"$error":"#VALUE!"},{"$error":"#VALUE!"},"","",{"$error":"#VALUE!"},{"$f":"SUM($H$20:$H252)","v":0}]
[{"$f":"IF(Values_Entered,A252+1,\"\")","v":""},"","","",{"$error":"#VALUE!"},{"$error":"#VALUE!"},"","",{"$error":"#VALUE!"},{"$f":"SUM($H$20:$H253)","v":0}]
[{"$f":"IF(Values_Entered,A253+1,\"\")","v":""},"","","",{"$error":"#VALUE!"},{"$error":"#VALUE!"},"","",{"$error":"#VALUE!"},{"$f":"SUM($H$20:$H254)","v":0}]
[{"$f":"IF(Values_Entered,A254+1,\"\")","v":""},"","","",{"$error":"#VALUE!"},{"$error":"#VALUE!"},"","",{"$error":"#VALUE!"},{"$f":"SUM($H$20:$H255)","v":0}]
[{"$f":"IF(Values_Entered,A255+1,\"\")","v":""},"","","",{"$error":"#VALUE!"},{"$error":"#VALUE!"},"","",{"$error":"#VALUE!"},{"$f":"SUM($H$20:$H256)","v":0}]
[{"$f":"IF(Values_Entered,A256+1,\"\")","v":""},"","","",{"$error":"#VALUE!"},{"$error":"#VALUE!"},"","",{"$error":"#VALUE!"},{"$f":"SUM($H$20:$H257)","v":0}]
[{"$f":"IF(Values_Entered,A257+1,\"\")","v":""},"","","",{"$error":"#VALUE!"},{"$error":"#VALUE!"},"","",{"$error":"#VALUE!"},{"$f":"SUM($H$20:$H258)","v":0}]
[{"$f":"IF(Values_Entered,A258+1,\"\")","v":""},"","","",{"$error":"#VALUE!"},{"$error":"#VALUE!"},"","",{"$error":"#VALUE!"},{"$f":"SUM($H$20:$H259)","v":0}]
[{"$f":"IF(Values_Entered,A259+1,\"\")","v":""},"","","",{"$error":"#VALUE!"},{"$error":"#VALUE!"},"","",{"$error":"#VALUE!"},{"$f":"SUM($H$20:$H260)","v":0}]
[{"$f":"IF(Values_Entered,A260+1,\"\")","v":""},"","","",{"$error":"#VALUE!"},{"$error":"#VALUE!"},"","",{"$error":"#VALUE!"},{"$f":"SUM($H$20:$H261)","v":0}]
[{"$f":"IF(Values_Entered,A261+1,\"\")","v":""},"","","",{"$error":"#VALUE!"},{"$error":"#VALUE!"},"","",{"$error":"#VALUE!"},{"$f":"SUM($H$20:$H262)","v":0}]
[{"$f":"IF(Values_Entered,A262+1,\"\")","v":""},"","","",{"$error":"#VALUE!"},{"$error":"#VALUE!"},"","",{"$error":"#VALUE!"},{"$f":"SUM($H$20:$H263)","v":0}]
[{"$f":"IF(Values_Entered,A263+1,\"\")","v":""},"","","",{"$error":"#VALUE!"},{"$error":"#VALUE!"},"","",{"$error":"#VALUE!"},{"$f":"SUM($H$20:$H264)","v":0}]
[{"$f":"IF(Values_Entered,A264+1,\"\")","v":""},"","","",{"$error":"#VALUE!"},{"$error":"#VALUE!"},"","",{"$error":"#VALUE!"},{"$f":"SUM($H$20:$H265)","v":0}]
[{"$f":"IF(Values_Entered,A265+1,\"\")","v":""},"","","",{"$error":"#VALUE!"},{"$error":"#VALUE!"},"","",{"$error":"#VALUE!"},{"$f":"SUM($H$20:$H266)","v":0}]
[{"$f":"IF(Values_Entered,A266+1,\"\")","v":""},"","","",{"$error":"#VALUE!"},{"$error":"#VALUE!"},"","",{"$error":"#VALUE!"},{"$f":"SUM($H$20:$H267)","v":0}]
[{"$f":"IF(Values_Entered,A267+1,\"\")","v":""},"","","",{"$error":"#VALUE!"},{"$error":"#VALUE!"},"","",{"$error":"#VALUE!"},{"$f":"SUM($H$20:$H268)","v":0}]
[{"$f":"IF(Values_Entered,A268+1,\"\")","v":""},"","","",{"$error":"#VALUE!"},{"$error":"#VALUE!"},"","",{"$error":"#VALUE!"},{"$f":"SUM($H$20:$H269)","v":0}]
[{"$f":"IF(Values_Entered,A269+1,\"\")","v":""},"","","",{"$error":"#VALUE!"},{"$error":"#VALUE!"},"","",{"$error":"#VALUE!"},{"$f":"SUM($H$20:$H270)","v":0}]
[{"$f":"IF(Values_Entered,A270+1,\"\")","v":""},"","","",{"$error":"#VALUE!"},{"$error":"#VALUE!"},"","",{"$error":"#VALUE!"},{"$f":"SUM($H$20:$H271)","v":0}]
[{"$f":"IF(Values_Entered,A271+1,\"\")","v":""},"","","",{"$error":"#VALUE!"},{"$error":"#VALUE!"},"","",{"$error":"#VALUE!"},{"$f":"SUM($H$20:$H272)","v":0}]
[{"$f":"IF(Values_Entered,A272+1,\"\")","v":""},"","","",{"$error":"#VALUE!"},{"$error":"#VALUE!"},"","",{"$error":"#VALUE!"},{"$f":"SUM($H$20:$H273)","v":0}]
[{"$f":"IF(Values_Entered,A273+1,\"\")","v":""},"","","",{"$error":"#VALUE!"},{"$error":"#VALUE!"},"","",{"$error":"#VALUE!"},{"$f":"SUM($H$20:$H274)","v":0}]
[{"$f":"IF(Values_Entered,A274+1,\"\")","v":""},"","","",{"$error":"#VALUE!"},{"$error":"#VALUE!"},"","",{"$error":"#VALUE!"},{"$f":"SUM($H$20:$H275)","v":0}]
[{"$f":"IF(Values_Entered,A275+1,\"\")","v":""},{"$f":"IF(Pay_Num<>\"\",DATE(YEAR(Loan_Start),MONTH(Loan_Start)+(Pay_Num)*12/Num_Pmt_Per_Year,DAY(Loan_Start)),\"\")","v":""},"","",{"$f":"IF(AND(Pay_Num<>\"\",Sched_Pay+Scheduled_Extra_Payments<Beg_Bal),Scheduled_Extra_Payments,IF(AND(Pay_Num<>\"\",Beg_Bal-Sched_Pay>0),Beg_Bal-Sched_Pay,IF(Pay_Num<>\"\",0,\"\")))","v":{"$error":"#VALUE!"}},{"$f":"IF(AND(Pay_Num<>\"\",Sched_Pay+Extra_Pay<Beg_Bal),Sched_Pay+Extra_Pay,IF(Pay_Num<>\"\",Beg_Bal,\"\"))","v":{"$error":"#VALUE!"}},"","",{"$f":"IF(AND(Pay_Num<>\"\",Sched_Pay+Extra_Pay<Beg_Bal),Beg_Bal-Princ,IF(Pay_Num<>\"\",0,\"\"))","v":{"$error":"#VALUE!"}},{"$f":"SUM($H$20:$H276)","v":0}]
[{"$f":"IF(Values_Entered,A276+1,\"\")","v":""},"",{"$f":"IF(Pay_Num<>\"\",I276,\"\")","v":""},"",{"$error":"#VALUE!"},{"$error":"#VALUE!"},{"$f":"IF(Pay_Num<>\"\",Total_Pay-Int,\"\")","v":""},{"$f":"IF(Pay_Num<>\"\",Beg_Bal*Interest_Rate/Num_Pmt_Per_Year,\"\")","v":""},{"$error":"#VALUE!"},{"$f":"SUM($H$20:$H277)","v":0}]
[{"$f":"IF(Values_Entered,A277+1,\"\")","v":""},"","",{"$f":"IF(Pay_Num<>\"\",Scheduled_Monthly_Payment,\"\")","v":""},{"$error":"#VALUE!"},{"$error":"#VALUE!"},"","",{"$error":"#VALUE!"},{"$f":"SUM($H$20:$H278)","v":0}]
[{"$f":"IF(Values_Entered,A278+1,\"\")","v":""},"","","",{"$error":"#VALUE!"},{"$error":"#VALUE!"},"","",{"$error":"#VALUE!"},{"$f":"SUM($H$20:$H279)","v":0}]
[{"$f":"IF(Values_Entered,A279+1,\"\")","v":""},"","","",{"$error":"#VALUE!"},{"$error":"#VALUE!"},"","",{"$error":"#VALUE!"},{"$f":"SUM($H$20:$H280)","v":0}]
[{"$f":"IF(Values_Entered,A280+1,\"\")","v":""},"","","",{"$error":"#VALUE!"},{"$error":"#VALUE!"},"","",{"$error":"#VALUE!"},{"$f":"SUM($H$20:$H281)","v":0}]
[{"$f":"IF(Values_Entered,A281+1,\"\")","v":""},"","","",{"$error":"#VALUE!"},{"$error":"#VALUE!"},"","",{"$error":"#VALUE!"},{"$f":"SUM($H$20:$H282)","v":0}]
[{"$f":"IF(Values_Entered,A282+1,\"\")","v":""},"","","",{"$error":"#VALUE!"},{"$error":"#VALUE!"},"","",{"$error":"#VALUE!"},{"$f":"SUM($H$20:$H283)","v":0}]
[{"$f":"IF(Values_Entered,A283+1,\"\")","v":""},"","","",{"$error":"#VALUE!"},{"$error":"#VALUE!"},"","",{"$error":"#VALUE!"},{"$f":"SUM($H$20:$H284)","v":0}]
[{"$f":"IF(Values_Entered,A284+1,\"\")","v":""},"","","",{"$error":"#VALUE!"},{"$error":"#VALUE!"},"","",{"$error":"#VALUE!"},{"$f":"SUM($H$20:$H285)","v":0}]
[{"$f":"IF(Values_Entered,A285+1,\"\")","v":""},"","","",{"$error":"#VALUE!"},{"$error":"#VALUE!"},"","",{"$error":"#VALUE!"},{"$f":"SUM($H$20:$H286)","v":0}]
[{"$f":"IF(Values_Entered,A286+1,\"\")","v":""},"","","",{"$error":"#VALUE!"},{"$error":"#VALUE!"},"","",{"$error":"#VALUE!"},{"$f":"SUM($H$20:$H287)","v":0}]
[{"$f":"IF(Values_Entered,A287+1,\"\")","v":""},"","","",{"$error":"#VALUE!"},{"$error":"#VALUE!"},"","",{"$error":"#VALUE!"},{"$f":"SUM($H$20:$H288)","v":0}]
[{"$f":"IF(Values_Entered,A288+1,\"\")","v":""},"","","",{"$error":"#VALUE!"},{"$error":"#VALUE!"},"","",{"$error":"#VALUE!"},{"$f":"SUM($H$20:$H289)","v":0}]
[{"$f":"IF(Values_Entered,A289+1,\"\")","v":""},"","","",{"$error":"#VALUE!"},{"$error":"#VALUE!"},"","",{"$error":"#VALUE!"},{"$f":"SUM($H$20:$H290)","v":0}]
[{"$f":"IF(Values_Entered,A290+1,\"\")","v":""},"","","",{"$error":"#VALUE!"},{"$error":"#VALUE!"},"","",{"$error":"#VALUE!"},{"$f":"SUM($H$20:$H291)","v":0}]
[{"$f":"IF(Values_Entered,A291+1,\"\")","v":""},"","","",{"$error":"#VALUE!"},{"$error":"#VALUE!"},"","",{"$error":"#VALUE!"},{"$f":"SUM($H$20:$H292)","v":0}]
[{"$f":"IF(Values_Entered,A292+1,\"\")","v":""},"","","",{"$error":"#VALUE!"},{"$error":"#VALUE!"},"","",{"$error":"#VALUE!"},{"$f":"SUM($H$20:$H293)","v":0}]
[{"$f":"IF(Values_Entered,A293+1,\"\")","v":""},"","","",{"$error":"#VALUE!"},{"$error":"#VALUE!"},"","",{"$error":"#VALUE!"},{"$f":"SUM($H$20:$H294)","v":0}]
[{"$f":"IF(Values_Entered,A294+1,\"\")","v":""},"","","",{"$error":"#VALUE!"},{"$error":"#VALUE!"},"","",{"$error":"#VALUE!"},{"$f":"SUM($H$20:$H295)","v":0}]
[{"$f":"IF(Values_Entered,A295+1,\"\")","v":""},"","","",{"$error":"#VALUE!"},{"$error":"#VALUE!"},"","",{"$error":"#VALUE!"},{"$f":"SUM($H$20:$H296)","v":0}]
[{"$f":"IF(Values_Entered,A296+1,\"\")","v":""},"","","",{"$error":"#VALUE!"},{"$error":"#VALUE!"},"","",{"$error":"#VALUE!"},{"$f":"SUM($H$20:$H297)","v":0}]
[{"$f":"IF(Values_Entered,A297+1,\"\")","v":""},"","","",{"$error":"#VALUE!"},{"$error":"#VALUE!"},"","",{"$error":"#VALUE!"},{"$f":"SUM($H$20:$H298)","v":0}]
[{"$f":"IF(Values_Entered,A298+1,\"\")","v":""},"","","",{"$error":"#VALUE!"},{"$error":"#VALUE!"},"","",{"$error":"#VALUE!"},{"$f":"SUM($H$20:$H299)","v":0}]
[{"$f":"IF(Values_Entered,A299+1,\"\")","v":""},"","","",{"$error":"#VALUE!"},{"$error":"#VALUE!"},"","",{"$error":"#VALUE!"},{"$f":"SUM($H$20:$H300)","v":0}]
[{"$f":"IF(Values_Entered,A300+1,\"\")","v":""},"","","",{"$error":"#VALUE!"},{"$error":"#VALUE!"},"","",{"$error":"#VALUE!"},{"$f":"SUM($H$20:$H301)","v":0}]
[{"$f":"IF(Values_Entered,A301+1,\"\")","v":""},"","","",{"$error":"#VALUE!"},{"$error":"#VALUE!"},"","",{"$error":"#VALUE!"},{"$f":"SUM($H$20:$H302)","v":0}]
[{"$f":"IF(Values_Entered,A302+1,\"\")","v":""},"","","",{"$error":"#VALUE!"},{"$error":"#VALUE!"},"","",{"$error":"#VALUE!"},{"$f":"SUM($H$20:$H303)","v":0}]
[{"$f":"IF(Values_Entered,A303+1,\"\")","v":""},"","","",{"$error":"#VALUE!"},{"$error":"#VALUE!"},"","",{"$error":"#VALUE!"},{"$f":"SUM($H$20:$H304)","v":0}]
[{"$f":"IF(Values_Entered,A304+1,\"\")","v":""},"","","",{"$error":"#VALUE!"},{"$error":"#VALUE!"},"","",{"$error":"#VALUE!"},{"$f":"SUM($H$20:$H305)","v":0}]
[{"$f":"IF(Values_Entered,A305+1,\"\")","v":""},"","","",{"$error":"#VALUE!"},{"$error":"#VALUE!"},"","",{"$error":"#VALUE!"},{"$f":"SUM($H$20:$H306)","v":0}]
[{"$f":"IF(Values_Entered,A306+1,\"\")","v":""},"","","",{"$error":"#VALUE!"},{"$error":"#VALUE!"},"","",{"$error":"#VALUE!"},{"$f":"SUM($H$20:$H307)","v":0}]
[{"$f":"IF(Values_Entered,A307+1,\"\")","v":""},"","","",{"$error":"#VALUE!"},{"$error":"#VALUE!"},"","",{"$error":"#VALUE!"},{"$f":"SUM($H$20:$H308)","v":0}]
[{"$f":"IF(Values_Entered,A308+1,\"\")","v":""},"","","",{"$error":"#VALUE!"},{"$error":"#VALUE!"},"","",{"$error":"#VALUE!"},{"$f":"SUM($H$20:$H309)","v":0}]
[{"$f":"IF(Values_Entered,A309+1,\"\")","v":""},"","","",{"$error":"#VALUE!"},{"$error":"#VALUE!"},"","",{"$error":"#VALUE!"},{"$f":"SUM($H$20:$H310)","v":0}]
[{"$f":"IF(Values_Entered,A310+1,\"\")","v":""},"","","",{"$error":"#VALUE!"},{"$error":"#VALUE!"},"","",{"$error":"#VALUE!"},{"$f":"SUM($H$20:$H311)","v":0}]
[{"$f":"IF(Values_Entered,A311+1,\"\")","v":""},"","","",{"$error":"#VALUE!"},{"$error":"#VALUE!"},"","",{"$error":"#VALUE!"},{"$f":"SUM($H$20:$H312)","v":0}]
[{"$f":"IF(Values_Entered,A312+1,\"\")","v":""},"","","",{"$error":"#VALUE!"},{"$error":"#VALUE!"},"","",{"$error":"#VALUE!"},{"$f":"SUM($H$20:$H313)","v":0}]
[{"$f":"IF(Values_Entered,A313+1,\"\")","v":""},"","","",{"$error":"#VALUE!"},{"$error":"#VALUE!"},"","",{"$error":"#VALUE!"},{"$f":"SUM($H$20:$H314)","v":0}]
[{"$f":"IF(Values_Entered,A314+1,\"\")","v":""},"","","",{"$error":"#VALUE!"},{"$error":"#VALUE!"},"","",{"$error":"#VALUE!"},{"$f":"SUM($H$20:$H315)","v":0}]
[{"$f":"IF(Values_Entered,A315+1,\"\")","v":""},"","","",{"$error":"#VALUE!"},{"$error":"#VALUE!"},"","",{"$error":"#VALUE!"},{"$f":"SUM($H$20:$H316)","v":0}]
[{"$f":"IF(Values_Entered,A316+1,\"\")","v":""},"","","",{"$error":"#VALUE!"},{"$error":"#VALUE!"},"","",{"$error":"#VALUE!"},{"$f":"SUM($H$20:$H317)","v":0}]
[{"$f":"IF(Values_Entered,A317+1,\"\")","v":""},"","","",{"$error":"#VALUE!"},{"$error":"#VALUE!"},"","",{"$error":"#VALUE!"},{"$f":"SUM($H$20:$H318)","v":0}]
[{"$f":"IF(Values_Entered,A318+1,\"\")","v":""},"","","",{"$error":"#VALUE!"},{"$error":"#VALUE!"},"","",{"$error":"#VALUE!"},{"$f":"SUM($H$20:$H319)","v":0}]
[{"$f":"IF(Values_Entered,A319+1,\"\")","v":""},"","","",{"$error":"#VALUE!"},{"$error":"#VALUE!"},"","",{"$error":"#VALUE!"},{"$f":"SUM($H$20:$H320)","v":0}]
[{"$f":"IF(Values_Entered,A320+1,\"\")","v":""},"","","",{"$error":"#VALUE!"},{"$error":"#VALUE!"},"","",{"$error":"#VALUE!"},{"$f":"SUM($H$20:$H321)","v":0}]
[{"$f":"IF(Values_Entered,A321+1,\"\")","v":""},"","","",{"$error":"#VALUE!"},{"$error":"#VALUE!"},"","",{"$error":"#VALUE!"},{"$f":"SUM($H$20:$H322)","v":0}]
[{"$f":"IF(Values_Entered,A322+1,\"\")","v":""},"","","",{"$error":"#VALUE!"},{"$error":"#VALUE!"},"","",{"$error":"#VALUE!"},{"$f":"SUM($H$20:$H323)","v":0}]
[{"$f":"IF(Values_Entered,A323+1,\"\")","v":""},"","","",{"$error":"#VALUE!"},{"$error":"#VALUE!"},"","",{"$error":"#VALUE!"},{"$f":"SUM($H$20:$H324)","v":0}]
[{"$f":"IF(Values_Entered,A324+1,\"\")","v":""},"","","",{"$error":"#VALUE!"},{"$error":"#VALUE!"},"","",{"$error":"#VALUE!"},{"$f":"SUM($H$20:$H325)","v":0}]
[{"$f":"IF(Values_Entered,A325+1,\"\")","v":""},"","","",{"$error":"#VALUE!"},{"$error":"#VALUE!"},"","",{"$error":"#VALUE!"},{"$f":"SUM($H$20:$H326)","v":0}]
[{"$f":"IF(Values_Entered,A326+1,\"\")","v":""},"","","",{"$error":"#VALUE!"},{"$error":"#VALUE!"},"","",{"$error":"#VALUE!"},{"$f":"SUM($H$20:$H327)","v":0}]
[{"$f":"IF(Values_Entered,A327+1,\"\")","v":""},"","","",{"$error":"#VALUE!"},{"$error":"#VALUE!"},"","",{"$error":"#VALUE!"},{"$f":"SUM($H$20:$H328)","v":0}]
[{"$f":"IF(Values_Entered,A328+1,\"\")","v":""},"","","",{"$error":"#VALUE!"},{"$error":"#VALUE!"},"","",{"$error":"#VALUE!"},{"$f":"SUM($H$20:$H329)","v":0}]
[{"$f":"IF(Values_Entered,A329+1,\"\")","v":""},"","","",{"$error":"#VALUE!"},{"$error":"#VALUE!"},"","",{"$error":"#VALUE!"},{"$f":"SUM($H$20:$H330)","v":0}]
[{"$f":"IF(Values_Entered,A330+1,\"\")","v":""},"","","",{"$error":"#VALUE!"},{"$error":"#VALUE!"},"","",{"$error":"#VALUE!"},{"$f":"SUM($H$20:$H331)","v":0}]
[{"$f":"IF(Values_Entered,A331+1,\"\")","v":""},"","","",{"$error":"#VALUE!"},{"$error":"#VALUE!"},"","",{"$error":"#VALUE!"},{"$f":"SUM($H$20:$H332)","v":0}]
[{"$f":"IF(Values_Entered,A332+1,\"\")","v":""},"","","",{"$error":"#VALUE!"},{"$error":"#VALUE!"},"","",{"$error":"#VALUE!"},{"$f":"SUM($H$20:$H333)","v":0}]
[{"$f":"IF(Values_Entered,A333+1,\"\")","v":""},"","","",{"$error":"#VALUE!"},{"$error":"#VALUE!"},"","",{"$error":"#VALUE!"},{"$f":"SUM($H$20:$H334)","v":0}]
[{"$f":"IF(Values_Entered,A334+1,\"\")","v":""},"","","",{"$error":"#VALUE!"},{"$error":"#VALUE!"},"","",{"$error":"#VALUE!"},{"$f":"SUM($H$20:$H335)","v":0}]
[{"$f":"IF(Values_Entered,A335+1,\"\")","v":""},"","","",{"$error":"#VALUE!"},{"$error":"#VALUE!"},"","",{"$error":"#VALUE!"},{"$f":"SUM($H$20:$H336)","v":0}]
[{"$f":"IF(Values_Entered,A336+1,\"\")","v":""},"","","",{"$error":"#VALUE!"},{"$error":"#VALUE!"},"","",{"$error":"#VALUE!"},{"$f":"SUM($H$20:$H337)","v":0}]
[{"$f":"IF(Values_Entered,A337+1,\"\")","v":""},"","","",{"$error":"#VALUE!"},{"$error":"#VALUE!"},"","",{"$error":"#VALUE!"},{"$f":"SUM($H$20:$H338)","v":0}]
[{"$f":"IF(Values_Entered,A338+1,\"\")","v":""},"","","",{"$error":"#VALUE!"},{"$error":"#VALUE!"},"","",{"$error":"#VALUE!"},{"$f":"SUM($H$20:$H339)","v":0}]
[{"$f":"IF(Values_Entered,A339+1,\"\")","v":""},{"$f":"IF(Pay_Num<>\"\",DATE(YEAR(Loan_Start),MONTH(Loan_Start)+(Pay_Num)*12/Num_Pmt_Per_Year,DAY(Loan_Start)),\"\")","v":""},"","",{"$f":"IF(AND(Pay_Num<>\"\",Sched_Pay+Scheduled_Extra_Payments<Beg_Bal),Scheduled_Extra_Payments,IF(AND(Pay_Num<>\"\",Beg_Bal-Sched_Pay>0),Beg_Bal-Sched_Pay,IF(Pay_Num<>\"\",0,\"\")))","v":{"$error":"#VALUE!"}},{"$f":"IF(AND(Pay_Num<>\"\",Sched_Pay+Extra_Pay<Beg_Bal),Sched_Pay+Extra_Pay,IF(Pay_Num<>\"\",Beg_Bal,\"\"))","v":{"$error":"#VALUE!"}},"","",{"$f":"IF(AND(Pay_Num<>\"\",Sched_Pay+Extra_Pay<Beg_Bal),Beg_Bal-Princ,IF(Pay_Num<>\"\",0,\"\"))","v":{"$error":"#VALUE!"}},{"$f":"SUM($H$20:$H340)","v":0}]
[{"$f":"IF(Values_Entered,A340+1,\"\")","v":""},"",{"$f":"IF(Pay_Num<>\"\",I340,\"\")","v":""},"",{"$error":"#VALUE!"},{"$error":"#VALUE!"},{"$f":"IF(Pay_Num<>\"\",Total_Pay-Int,\"\")","v":""},{"$f":"IF(Pay_Num<>\"\",Beg_Bal*Interest_Rate/Num_Pmt_Per_Year,\"\")","v":""},{"$error":"#VALUE!"},{"$f":"SUM($H$20:$H341)","v":0}]
[{"$f":"IF(Values_Entered,A341+1,\"\")","v":""},"","",{"$f":"IF(Pay_Num<>\"\",Scheduled_Monthly_Payment,\"\")","v":""},{"$error":"#VALUE!"},{"$error":"#VALUE!"},"","",{"$error":"#VALUE!"},{"$f":"SUM($H$20:$H342)","v":0}]
[{"$f":"IF(Values_Entered,A342+1,\"\")","v":""},"","","",{"$error":"#VALUE!"},{"$error":"#VALUE!"},"","",{"$error":"#VALUE!"},{"$f":"SUM($H$20:$H343)","v":0}]
[{"$f":"IF(Values_Entered,A343+1,\"\")","v":""},"","","",{"$error":"#VALUE!"},{"$error":"#VALUE!"},"","",{"$error":"#VALUE!"},{"$f":"SUM($H$20:$H344)","v":0}]
[{"$f":"IF(Values_Entered,A344+1,\"\")","v":""},"","","",{"$error":"#VALUE!"},{"$error":"#VALUE!"},"","",{"$error":"#VALUE!"},{"$f":"SUM($H$20:$H345)","v":0}]
[{"$f":"IF(Values_Entered,A345+1,\"\")","v":""},"","","",{"$error":"#VALUE!"},{"$error":"#VALUE!"},"","",{"$error":"#VALUE!"},{"$f":"SUM($H$20:$H346)","v":0}]
[{"$f":"IF(Values_Entered,A346+1,\"\")","v":""},"","","",{"$error":"#VALUE!"},{"$error":"#VALUE!"},"","",{"$error":"#VALUE!"},{"$f":"SUM($H$20:$H347)","v":0}]
[{"$f":"IF(Values_Entered,A347+1,\"\")","v":""},"","","",{"$error":"#VALUE!"},{"$error":"#VALUE!"},"","",{"$error":"#VALUE!"},{"$f":"SUM($H$20:$H348)","v":0}]
[{"$f":"IF(Values_Entered,A348+1,\"\")","v":""},"","","",{"$error":"#VALUE!"},{"$error":"#VALUE!"},"","",{"$error":"#VALUE!"},{"$f":"SUM($H$20:$H349)","v":0}]
[{"$f":"IF(Values_Entered,A349+1,\"\")","v":""},"","","",{"$error":"#VALUE!"},{"$error":"#VALUE!"},"","",{"$error":"#VALUE!"},{"$f":"SUM($H$20:$H350)","v":0}]
[{"$f":"IF(Values_Entered,A350+1,\"\")","v":""},"","","",{"$error":"#VALUE!"},{"$error":"#VALUE!"},"","",{"$error":"#VALUE!"},{"$f":"SUM($H$20:$H351)","v":0}]
[{"$f":"IF(Values_Entered,A351+1,\"\")","v":""},"","","",{"$error":"#VALUE!"},{"$error":"#VALUE!"},"","",{"$error":"#VALUE!"},{"$f":"SUM($H$20:$H352)","v":0}]
[{"$f":"IF(Values_Entered,A352+1,\"\")","v":""},"","","",{"$error":"#VALUE!"},{"$error":"#VALUE!"},"","",{"$error":"#VALUE!"},{"$f":"SUM($H$20:$H353)","v":0}]
[{"$f":"IF(Values_Entered,A353+1,\"\")","v":""},"","","",{"$error":"#VALUE!"},{"$error":"#VALUE!"},"","",{"$error":"#VALUE!"},{"$f":"SUM($H$20:$H354)","v":0}]
[{"$f":"IF(Values_Entered,A354+1,\"\")","v":""},"","","",{"$error":"#VALUE!"},{"$error":"#VALUE!"},"","",{"$error":"#VALUE!"},{"$f":"SUM($H$20:$H355)","v":0}]
[{"$f":"IF(Values_Entered,A355+1,\"\")","v":""},"","","",{"$error":"#VALUE!"},{"$error":"#VALUE!"},"","",{"$error":"#VALUE!"},{"$f":"SUM($H$20:$H356)","v":0}]
[{"$f":"IF(Values_Entered,A356+1,\"\")","v":""},"","","",{"$error":"#VALUE!"},{"$error":"#VALUE!"},"","",{"$error":"#VALUE!"},{"$f":"SUM($H$20:$H357)","v":0}]
[{"$f":"IF(Values_Entered,A357+1,\"\")","v":""},"","","",{"$error":"#VALUE!"},{"$error":"#VALUE!"},"","",{"$error":"#VALUE!"},{"$f":"SUM($H$20:$H358)","v":0}]
[{"$f":"IF(Values_Entered,A358+1,\"\")","v":""},"","","",{"$error":"#VALUE!"},{"$error":"#VALUE!"},"","",{"$error":"#VALUE!"},{"$f":"SUM($H$20:$H359)","v":0}]
[{"$f":"IF(Values_Entered,A359+1,\"\")","v":""},"","","",{"$error":"#VALUE!"},{"$error":"#VALUE!"},"","",{"$error":"#VALUE!"},{"$f":"SUM($H$20:$H360)","v":0}]
[{"$f":"IF(Values_Entered,A360+1,\"\")","v":""},"","","",{"$error":"#VALUE!"},{"$error":"#VALUE!"},"","",{"$error":"#VALUE!"},{"$f":"SUM($H$20:$H361)","v":0}]
[{"$f":"IF(Values_Entered,A361+1,\"\")","v":""},"","","",{"$error":"#VALUE!"},{"$error":"#VALUE!"},"","",{"$error":"#VALUE!"},{"$f":"SUM($H$20:$H362)","v":0}]
[{"$f":"IF(Values_Entered,A362+1,\"\")","v":""},"","","",{"$error":"#VALUE!"},{"$error":"#VALUE!"},"","",{"$error":"#VALUE!"},{"$f":"SUM($H$20:$H363)","v":0}]
[{"$f":"IF(Values_Entered,A363+1,\"\")","v":""},"","","",{"$error":"#VALUE!"},{"$error":"#VALUE!"},"","",{"$error":"#VALUE!"},{"$f":"SUM($H$20:$H364)","v":0}]
[{"$f":"IF(Values_Entered,A364+1,\"\")","v":""},"","","",{"$error":"#VALUE!"},{"$error":"#VALUE!"},"","",{"$error":"#VALUE!"},{"$f":"SUM($H$20:$H365)","v":0}]
[{"$f":"IF(Values_Entered,A365+1,\"\")","v":""},"","","",{"$error":"#VALUE!"},{"$error":"#VALUE!"},"","",{"$error":"#VALUE!"},{"$f":"SUM($H$20:$H366)","v":0}]
[{"$f":"IF(Values_Entered,A366+1,\"\")","v":""},"","","",{"$error":"#VALUE!"},{"$error":"#VALUE!"},"","",{"$error":"#VALUE!"},{"$f":"SUM($H$20:$H367)","v":0}]
[{"$f":"IF(Values_Entered,A367+1,\"\")","v":""},"","","",{"$error":"#VALUE!"},{"$error":"#VALUE!"},"","",{"$error":"#VALUE!"},{"$f":"SUM($H$20:$H368)","v":0}]
[{"$f":"IF(Values_Entered,A368+1,\"\")","v":""},"","","",{"$error":"#VALUE!"},{"$error":"#VALUE!"},"","",{"$error":"#VALUE!"},{"$f":"SUM($H$20:$H369)","v":0}]
[{"$f":"IF(Values_Entered,A369+1,\"\")","v":""},"","","",{"$error":"#VALUE!"},{"$error":"#VALUE!"},"","",{"$error":"#VALUE!"},{"$f":"SUM($H$20:$H370)","v":0}]
[{"$f":"IF(Values_Entered,A370+1,\"\")","v":""},"","","",{"$error":"#VALUE!"},{"$error":"#VALUE!"},"","",{"$error":"#VALUE!"},{"$f":"SUM($H$20:$H371)","v":0}]
[{"$f":"IF(Values_Entered,A371+1,\"\")","v":""},"","","",{"$error":"#VALUE!"},{"$error":"#VALUE!"},"","",{"$error":"#VALUE!"},{"$f":"SUM($H$20:$H372)","v":0}]
[{"$f":"IF(Values_Entered,A372+1,\"\")","v":""},"","","",{"$error":"#VALUE!"},{"$error":"#VALUE!"},"","",{"$error":"#VALUE!"},{"$f":"SUM($H$20:$H373)","v":0}]
[{"$f":"IF(Values_Entered,A373+1,\"\")","v":""},"","","",{"$error":"#VALUE!"},{"$error":"#VALUE!"},"","",{"$error":"#VALUE!"},{"$f":"SUM($H$20:$H374)","v":0}]
[{"$f":"IF(Values_Entered,A374+1,\"\")","v":""},"","","",{"$error":"#VALUE!"},{"$error":"#VALUE!"},"","",{"$error":"#VALUE!"},{"$f":"SUM($H$20:$H375)","v":0}]
[{"$f":"IF(Values_Entered,A375+1,\"\")","v":""},"","","",{"$error":"#VALUE!"},{"$error":"#VALUE!"},"","",{"$error":"#VALUE!"},{"$f":"SUM($H$20:$H376)","v":0}]
[{"$f":"IF(Values_Entered,A376+1,\"\")","v":""},"","","",{"$error":"#VALUE!"},{"$error":"#VALUE!"},"","",{"$error":"#VALUE!"},{"$f":"SUM($H$20:$H377)","v":0}]
[{"$f":"IF(Values_Entered,A377+1,\"\")","v":""},"","","",{"$error":"#VALUE!"},{"$error":"#VALUE!"},"","",{"$error":"#VALUE!"},{"$f":"SUM($H$20:$H378)","v":0}]
[{"$f":"IF(Values_Entered,A378+1,\"\")","v":""},"","","",{"$error":"#VALUE!"},{"$error":"#VALUE!"},"","",{"$error":"#VALUE!"},{"$f":"SUM($H$20:$H379)","v":0}]

{"sheet":"Loan Repayment Grid","index":5,"n_rows":379,"n_cols":10,"rows_kept":379,"cut":false,"hidden":true,"merged":[[0,0,0,4],[0,5,0,9],[8,1,8,3],[8,5,8,7]]}
["Loan Repayment:",{"$nulls":4},{"$f":"Input!D57","v":"Grid powered irrigation system costs"}]
["Bank:",{"$f":"Input!E85","v":0}]
[]
[]
[]
[]
[]
[]
[null,"Enter Values",null,null,null,"Loan Summary"]
[null,null,"Loan Amount",{"$f":"Input!E82","v":0},null,null,"Scheduled Payment",{"$f":"IF(Values_Entered,-PMT(Interest_Rate/Num_Pmt_Per_Year,Loan_Years*Num_Pmt_Per_Year,Loan_Amount),\"0\")","v":"0"}]
[null,null,"Annual Interest Rate",{"$f":"Input!E83","v":0},null,null,"Scheduled Number of Payments",{"$f":"IF(Values_Entered,Loan_Years*Num_Pmt_Per_Year,\"\")","v":""}]
[null,null,"Loan Period in Years",{"$f":"Input!E84","v":0},null,null,"Actual Number of Payments",{"$f":"IF(Values_Entered,Number_of_Payments,\"\")","v":""}]
[null,null,"Number of Payments Per Year",1,null,null,"Total Early Payments",{"$f":"IF(Values_Entered,SUMIF(Beg_Bal,\">0\",Extra_Pay),\"\")","v":""}]
[null,null,"Start Date of Loan","2017-01-01",null,null,"Total Interest",{"$f":"IF(Values_Entered,SUMIF(Beg_Bal,\">0\",Int),\"\")","v":""}]
[null,null,"Optional Extra Payments",0]
[]
[]
["PmtNo.","Payment Date","Beginning Balance","Scheduled Payment","Extra Payment","Total Payment","Principal","Interest","Ending Balance","Cumulative Interest"]
[]
[{"$f":"IF(Values_Entered,1,\"\")","v":""},{"$f":"IF(Pay_Num<>\"\",DATE(YEAR(Loan_Start),MONTH(Loan_Start)+(Pay_Num)*12/Num_Pmt_Per_Year,DAY(Loan_Start)),\"\")","v":""},{"$f":"IF(Values_Entered,Loan_Amount,\"\")","v":""},{"$f":"IF(Pay_Num<>\"\",Scheduled_Monthly_Payment,\"\")","v":""},{"$f":"IF(AND(Pay_Num<>\"\",Sched_Pay+Scheduled_Extra_Payments<Beg_Bal),Scheduled_Extra_Payments,IF(AND(Pay_Num<>\"\",Beg_Bal-Sched_Pay>0),Beg_Bal-Sched_Pay,IF(Pay_Num<>\"\",0,\"\")))","v":{"$error":"#VALUE!"}},{"$f":"IF(AND(Pay_Num<>\"\",Sched_Pay+Extra_Pay<Beg_Bal),Sched_Pay+Extra_Pay,IF(Pay_Num<>\"\",Beg_Bal,\"\"))","v":{"$error":"#VALUE!"}},{"$f":"IF(Pay_Num<>\"\",Total_Pay-Int,\"\")","v":""},{"$f":"IF(Pay_Num<>\"\",Beg_Bal*(Interest_Rate/Num_Pmt_Per_Year),\"\")","v":""},{"$f":"IF(AND(Pay_Num<>\"\",Sched_Pay+Extra_Pay<Beg_Bal),Beg_Bal-Princ,IF(Pay_Num<>\"\",0,\"\"))","v":{"$error":"#VALUE!"}},{"$f":"SUM($H$20:$H20)","v":0}]
[{"$f":"IF(Values_Entered,A20+1,\"\")","v":""},"",{"$f":"IF(Pay_Num<>\"\",I20,\"\")","v":""},{"$f":"IF(Pay_Num<>\"\",Scheduled_Monthly_Payment,\"\")","v":""},{"$error":"#VALUE!"},{"$error":"#VALUE!"},{"$f":"IF(Pay_Num<>\"\",Total_Pay-Int,\"\")","v":""},{"$f":"IF(Pay_Num<>\"\",Beg_Bal*Interest_Rate/Num_Pmt_Per_Year,\"\")","v":""},{"$error":"#VALUE!"},{"$f":"SUM($H$20:$H21)","v":0}]
[{"$f":"IF(Values_Entered,A21+1,\"\")","v":""},"","",{"$f":"IF(Pay_Num<>\"\",Scheduled_Monthly_Payment,\"\")","v":""},{"$error":"#VALUE!"},{"$error":"#VALUE!"},"","",{"$error":"#VALUE!"},{"$f":"SUM($H$20:$H22)","v":0}]
[{"$f":"IF(Values_Entered,A22+1,\"\")","v":""},"","",{"$f":"IF(Pay_Num<>\"\",Scheduled_Monthly_Payment,\"\")","v":""},{"$error":"#VALUE!"},{"$error":"#VALUE!"},"","",{"$error":"#VALUE!"},{"$f":"SUM($H$20:$H23)","v":0}]
[{"$f":"IF(Values_Entered,A23+1,\"\")","v":""},"","","",{"$error":"#VALUE!"},{"$error":"#VALUE!"},"","",{"$error":"#VALUE!"},{"$f":"SUM($H$20:$H24)","v":0}]
[{"$f":"IF(Values_Entered,A24+1,\"\")","v":""},"","","",{"$error":"#VALUE!"},{"$error":"#VALUE!"},"","",{"$error":"#VALUE!"},{"$f":"SUM($H$20:$H25)","v":0}]
[{"$f":"IF(Values_Entered,A25+1,\"\")","v":""},"","","",{"$error":"#VALUE!"},{"$error":"#VALUE!"},"","",{"$error":"#VALUE!"},{"$f":"SUM($H$20:$H26)","v":0}]
[{"$f":"IF(Values_Entered,A26+1,\"\")","v":""},"","","",{"$error":"#VALUE!"},{"$error":"#VALUE!"},"","",{"$error":"#VALUE!"},{"$f":"SUM($H$20:$H27)","v":0}]
[{"$f":"IF(Values_Entered,A27+1,\"\")","v":""},"","","",{"$error":"#VALUE!"},{"$error":"#VALUE!"},"","",{"$error":"#VALUE!"},{"$f":"SUM($H$20:$H28)","v":0}]
[{"$f":"IF(Values_Entered,A28+1,\"\")","v":""},"","","",{"$error":"#VALUE!"},{"$error":"#VALUE!"},"","",{"$error":"#VALUE!"},{"$f":"SUM($H$20:$H29)","v":0}]
[{"$f":"IF(Values_Entered,A29+1,\"\")","v":""},"","","",{"$error":"#VALUE!"},{"$error":"#VALUE!"},"","",{"$error":"#VALUE!"},{"$f":"SUM($H$20:$H30)","v":0}]
[{"$f":"IF(Values_Entered,A30+1,\"\")","v":""},"","","",{"$error":"#VALUE!"},{"$error":"#VALUE!"},"","",{"$error":"#VALUE!"},{"$f":"SUM($H$20:$H31)","v":0}]
[{"$f":"IF(Values_Entered,A31+1,\"\")","v":""},"","","",{"$error":"#VALUE!"},{"$error":"#VALUE!"},"","",{"$error":"#VALUE!"},{"$f":"SUM($H$20:$H32)","v":0}]
[{"$f":"IF(Values_Entered,A32+1,\"\")","v":""},"","","",{"$error":"#VALUE!"},{"$error":"#VALUE!"},"","",{"$error":"#VALUE!"},{"$f":"SUM($H$20:$H33)","v":0}]
[{"$f":"IF(Values_Entered,A33+1,\"\")","v":""},"","","",{"$error":"#VALUE!"},{"$error":"#VALUE!"},"","",{"$error":"#VALUE!"},{"$f":"SUM($H$20:$H34)","v":0}]
[{"$f":"IF(Values_Entered,A34+1,\"\")","v":""},"","","",{"$error":"#VALUE!"},{"$error":"#VALUE!"},"","",{"$error":"#VALUE!"},{"$f":"SUM($H$20:$H35)","v":0}]
[{"$f":"IF(Values_Entered,A35+1,\"\")","v":""},"","","",{"$error":"#VALUE!"},{"$error":"#VALUE!"},"","",{"$error":"#VALUE!"},{"$f":"SUM($H$20:$H36)","v":0}]
[{"$f":"IF(Values_Entered,A36+1,\"\")","v":""},"","","",{"$error":"#VALUE!"},{"$error":"#VALUE!"},"","",{"$error":"#VALUE!"},{"$f":"SUM($H$20:$H37)","v":0}]
[{"$f":"IF(Values_Entered,A37+1,\"\")","v":""},"","","",{"$error":"#VALUE!"},{"$error":"#VALUE!"},"","",{"$error":"#VALUE!"},{"$f":"SUM($H$20:$H38)","v":0}]
[{"$f":"IF(Values_Entered,A38+1,\"\")","v":""},"","","",{"$error":"#VALUE!"},{"$error":"#VALUE!"},"","",{"$error":"#VALUE!"},{"$f":"SUM($H$20:$H39)","v":0}]
[{"$f":"IF(Values_Entered,A39+1,\"\")","v":""},"","","",{"$error":"#VALUE!"},{"$error":"#VALUE!"},"","",{"$error":"#VALUE!"},{"$f":"SUM($H$20:$H40)","v":0}]
[{"$f":"IF(Values_Entered,A40+1,\"\")","v":""},"","","",{"$error":"#VALUE!"},{"$error":"#VALUE!"},"","",{"$error":"#VALUE!"},{"$f":"SUM($H$20:$H41)","v":0}]
[{"$f":"IF(Values_Entered,A41+1,\"\")","v":""},"","","",{"$error":"#VALUE!"},{"$error":"#VALUE!"},"","",{"$error":"#VALUE!"},{"$f":"SUM($H$20:$H42)","v":0}]
[{"$f":"IF(Values_Entered,A42+1,\"\")","v":""},"","","",{"$error":"#VALUE!"},{"$error":"#VALUE!"},"","",{"$error":"#VALUE!"},{"$f":"SUM($H$20:$H43)","v":0}]
[{"$f":"IF(Values_Entered,A43+1,\"\")","v":""},"","","",{"$error":"#VALUE!"},{"$error":"#VALUE!"},"","",{"$error":"#VALUE!"},{"$f":"SUM($H$20:$H44)","v":0}]
[{"$f":"IF(Values_Entered,A44+1,\"\")","v":""},"","","",{"$error":"#VALUE!"},{"$error":"#VALUE!"},"","",{"$error":"#VALUE!"},{"$f":"SUM($H$20:$H45)","v":0}]
[{"$f":"IF(Values_Entered,A45+1,\"\")","v":""},"","","",{"$error":"#VALUE!"},{"$error":"#VALUE!"},"","",{"$error":"#VALUE!"},{"$f":"SUM($H$20:$H46)","v":0}]
[{"$f":"IF(Values_Entered,A46+1,\"\")","v":""},"","","",{"$error":"#VALUE!"},{"$error":"#VALUE!"},"","",{"$error":"#VALUE!"},{"$f":"SUM($H$20:$H47)","v":0}]
[{"$f":"IF(Values_Entered,A47+1,\"\")","v":""},"","","",{"$error":"#VALUE!"},{"$error":"#VALUE!"},"","",{"$error":"#VALUE!"},{"$f":"SUM($H$20:$H48)","v":0}]
[{"$f":"IF(Values_Entered,A48+1,\"\")","v":""},"","","",{"$error":"#VALUE!"},{"$error":"#VALUE!"},"","",{"$error":"#VALUE!"},{"$f":"SUM($H$20:$H49)","v":0}]
[{"$f":"IF(Values_Entered,A49+1,\"\")","v":""},"","","",{"$error":"#VALUE!"},{"$error":"#VALUE!"},"","",{"$error":"#VALUE!"},{"$f":"SUM($H$20:$H50)","v":0}]
[{"$f":"IF(Values_Entered,A50+1,\"\")","v":""},"","","",{"$error":"#VALUE!"},{"$error":"#VALUE!"},"","",{"$error":"#VALUE!"},{"$f":"SUM($H$20:$H51)","v":0}]
[{"$f":"IF(Values_Entered,A51+1,\"\")","v":""},"","","",{"$error":"#VALUE!"},{"$error":"#VALUE!"},"","",{"$error":"#VALUE!"},{"$f":"SUM($H$20:$H52)","v":0}]
[{"$f":"IF(Values_Entered,A52+1,\"\")","v":""},"","","",{"$error":"#VALUE!"},{"$error":"#VALUE!"},"","",{"$error":"#VALUE!"},{"$f":"SUM($H$20:$H53)","v":0}]
[{"$f":"IF(Values_Entered,A53+1,\"\")","v":""},"","","",{"$error":"#VALUE!"},{"$error":"#VALUE!"},"","",{"$error":"#VALUE!"},{"$f":"SUM($H$20:$H54)","v":0}]
[{"$f":"IF(Values_Entered,A54+1,\"\")","v":""},"","","",{"$error":"#VALUE!"},{"$error":"#VALUE!"},"","",{"$error":"#VALUE!"},{"$f":"SUM($H$20:$H55)","v":0}]
[{"$f":"IF(Values_Entered,A55+1,\"\")","v":""},"","","",{"$error":"#VALUE!"},{"$error":"#VALUE!"},"","",{"$error":"#VALUE!"},{"$f":"SUM($H$20:$H56)","v":0}]
[{"$f":"IF(Values_Entered,A56+1,\"\")","v":""},"","","",{"$error":"#VALUE!"},{"$error":"#VALUE!"},"","",{"$error":"#VALUE!"},{"$f":"SUM($H$20:$H57)","v":0}]
[{"$f":"IF(Values_Entered,A57+1,\"\")","v":""},"","","",{"$error":"#VALUE!"},{"$error":"#VALUE!"},"","",{"$error":"#VALUE!"},{"$f":"SUM($H$20:$H58)","v":0}]
[{"$f":"IF(Values_Entered,A58+1,\"\")","v":""},"","","",{"$error":"#VALUE!"},{"$error":"#VALUE!"},"","",{"$error":"#VALUE!"},{"$f":"SUM($H$20:$H59)","v":0}]
[{"$f":"IF(Values_Entered,A59+1,\"\")","v":""},"","","",{"$error":"#VALUE!"},{"$error":"#VALUE!"},"","",{"$error":"#VALUE!"},{"$f":"SUM($H$20:$H60)","v":0}]
[{"$f":"IF(Values_Entered,A60+1,\"\")","v":""},"","","",{"$error":"#VALUE!"},{"$error":"#VALUE!"},"","",{"$error":"#VALUE!"},{"$f":"SUM($H$20:$H61)","v":0}]
[{"$f":"IF(Values_Entered,A61+1,\"\")","v":""},"","","",{"$error":"#VALUE!"},{"$error":"#VALUE!"},"","",{"$error":"#VALUE!"},{"$f":"SUM($H$20:$H62)","v":0}]
[{"$f":"IF(Values_Entered,A62+1,\"\")","v":""},"","","",{"$error":"#VALUE!"},{"$error":"#VALUE!"},"","",{"$error":"#VALUE!"},{"$f":"SUM($H$20:$H63)","v":0}]
[{"$f":"IF(Values_Entered,A63+1,\"\")","v":""},"","","",{"$error":"#VALUE!"},{"$error":"#VALUE!"},"","",{"$error":"#VALUE!"},{"$f":"SUM($H$20:$H64)","v":0}]
[{"$f":"IF(Values_Entered,A64+1,\"\")","v":""},"","","",{"$error":"#VALUE!"},{"$error":"#VALUE!"},"","",{"$error":"#VALUE!"},{"$f":"SUM($H$20:$H65)","v":0}]
[{"$f":"IF(Values_Entered,A65+1,\"\")","v":""},"","","",{"$error":"#VALUE!"},{"$error":"#VALUE!"},"","",{"$error":"#VALUE!"},{"$f":"SUM($H$20:$H66)","v":0}]
[{"$f":"IF(Values_Entered,A66+1,\"\")","v":""},"","","",{"$error":"#VALUE!"},{"$error":"#VALUE!"},"","",{"$error":"#VALUE!"},{"$f":"SUM($H$20:$H67)","v":0}]
[{"$f":"IF(Values_Entered,A67+1,\"\")","v":""},"","","",{"$error":"#VALUE!"},{"$error":"#VALUE!"},"","",{"$error":"#VALUE!"},{"$f":"SUM($H$20:$H68)","v":0}]
[{"$f":"IF(Values_Entered,A68+1,\"\")","v":""},"","","",{"$error":"#VALUE!"},{"$error":"#VALUE!"},"","",{"$error":"#VALUE!"},{"$f":"SUM($H$20:$H69)","v":0}]
[{"$f":"IF(Values_Entered,A69+1,\"\")","v":""},"","","",{"$error":"#VALUE!"},{"$error":"#VALUE!"},"","",{"$error":"#VALUE!"},{"$f":"SUM($H$20:$H70)","v":0}]
[{"$f":"IF(Values_Entered,A70+1,\"\")","v":""},"","","",{"$error":"#VALUE!"},{"$error":"#VALUE!"},"","",{"$error":"#VALUE!"},{"$f":"SUM($H$20:$H71)","v":0}]
[{"$f":"IF(Values_Entered,A71+1,\"\")","v":""},"","","",{"$error":"#VALUE!"},{"$error":"#VALUE!"},"","",{"$error":"#VALUE!"},{"$f":"SUM($H$20:$H72)","v":0}]
[{"$f":"IF(Values_Entered,A72+1,\"\")","v":""},"","","",{"$error":"#VALUE!"},{"$error":"#VALUE!"},"","",{"$error":"#VALUE!"},{"$f":"SUM($H$20:$H73)","v":0}]
[{"$f":"IF(Values_Entered,A73+1,\"\")","v":""},"","","",{"$error":"#VALUE!"},{"$error":"#VALUE!"},"","",{"$error":"#VALUE!"},{"$f":"SUM($H$20:$H74)","v":0}]
[{"$f":"IF(Values_Entered,A74+1,\"\")","v":""},"","","",{"$error":"#VALUE!"},{"$error":"#VALUE!"},"","",{"$error":"#VALUE!"},{"$f":"SUM($H$20:$H75)","v":0}]
[{"$f":"IF(Values_Entered,A75+1,\"\")","v":""},"","","",{"$error":"#VALUE!"},{"$error":"#VALUE!"},"","",{"$error":"#VALUE!"},{"$f":"SUM($H$20:$H76)","v":0}]
[{"$f":"IF(Values_Entered,A76+1,\"\")","v":""},"","","",{"$error":"#VALUE!"},{"$error":"#VALUE!"},"","",{"$error":"#VALUE!"},{"$f":"SUM($H$20:$H77)","v":0}]
[{"$f":"IF(Values_Entered,A77+1,\"\")","v":""},"","","",{"$error":"#VALUE!"},{"$error":"#VALUE!"},"","",{"$error":"#VALUE!"},{"$f":"SUM($H$20:$H78)","v":0}]
[{"$f":"IF(Values_Entered,A78+1,\"\")","v":""},"","","",{"$error":"#VALUE!"},{"$error":"#VALUE!"},"","",{"$error":"#VALUE!"},{"$f":"SUM($H$20:$H79)","v":0}]
[{"$f":"IF(Values_Entered,A79+1,\"\")","v":""},"","","",{"$error":"#VALUE!"},{"$error":"#VALUE!"},"","",{"$error":"#VALUE!"},{"$f":"SUM($H$20:$H80)","v":0}]
[{"$f":"IF(Values_Entered,A80+1,\"\")","v":""},"","","",{"$error":"#VALUE!"},{"$error":"#VALUE!"},"","",{"$error":"#VALUE!"},{"$f":"SUM($H$20:$H81)","v":0}]
[{"$f":"IF(Values_Entered,A81+1,\"\")","v":""},"","","",{"$error":"#VALUE!"},{"$error":"#VALUE!"},"","",{"$error":"#VALUE!"},{"$f":"SUM($H$20:$H82)","v":0}]
[{"$f":"IF(Values_Entered,A82+1,\"\")","v":""},"","","",{"$error":"#VALUE!"},{"$error":"#VALUE!"},"","",{"$error":"#VALUE!"},{"$f":"SUM($H$20:$H83)","v":0}]
[{"$f":"IF(Values_Entered,A83+1,\"\")","v":""},{"$f":"IF(Pay_Num<>\"\",DATE(YEAR(Loan_Start),MONTH(Loan_Start)+(Pay_Num)*12/Num_Pmt_Per_Year,DAY(Loan_Start)),\"\")","v":""},"","",{"$f":"IF(AND(Pay_Num<>\"\",Sched_Pay+Scheduled_Extra_Payments<Beg_Bal),Scheduled_Extra_Payments,IF(AND(Pay_Num<>\"\",Beg_Bal-Sched_Pay>0),Beg_Bal-Sched_Pay,IF(Pay_Num<>\"\",0,\"\")))","v":{"$error":"#VALUE!"}},{"$f":"IF(AND(Pay_Num<>\"\",Sched_Pay+Extra_Pay<Beg_Bal),Sched_Pay+Extra_Pay,IF(Pay_Num<>\"\",Beg_Bal,\"\"))","v":{"$error":"#VALUE!"}},"","",{"$f":"IF(AND(Pay_Num<>\"\",Sched_Pay+Extra_Pay<Beg_Bal),Beg_Bal-Princ,IF(Pay_Num<>\"\",0,\"\"))","v":{"$error":"#VALUE!"}},{"$f":"SUM($H$20:$H84)","v":0}]
[{"$f":"IF(Values_Entered,A84+1,\"\")","v":""},"",{"$f":"IF(Pay_Num<>\"\",I84,\"\")","v":""},"",{"$error":"#VALUE!"},{"$error":"#VALUE!"},{"$f":"IF(Pay_Num<>\"\",Total_Pay-Int,\"\")","v":""},{"$f":"IF(Pay_Num<>\"\",Beg_Bal*Interest_Rate/Num_Pmt_Per_Year,\"\")","v":""},{"$error":"#VALUE!"},{"$f":"SUM($H$20:$H85)","v":0}]
[{"$f":"IF(Values_Entered,A85+1,\"\")","v":""},"","",{"$f":"IF(Pay_Num<>\"\",Scheduled_Monthly_Payment,\"\")","v":""},{"$error":"#VALUE!"},{"$error":"#VALUE!"},"","",{"$error":"#VALUE!"},{"$f":"SUM($H$20:$H86)","v":0}]
[{"$f":"IF(Values_Entered,A86+1,\"\")","v":""},"","","",{"$error":"#VALUE!"},{"$error":"#VALUE!"},"","",{"$error":"#VALUE!"},{"$f":"SUM($H$20:$H87)","v":0}]
[{"$f":"IF(Values_Entered,A87+1,\"\")","v":""},"","","",{"$error":"#VALUE!"},{"$error":"#VALUE!"},"","",{"$error":"#VALUE!"},{"$f":"SUM($H$20:$H88)","v":0}]
[{"$f":"IF(Values_Entered,A88+1,\"\")","v":""},"","","",{"$error":"#VALUE!"},{"$error":"#VALUE!"},"","",{"$error":"#VALUE!"},{"$f":"SUM($H$20:$H89)","v":0}]
[{"$f":"IF(Values_Entered,A89+1,\"\")","v":""},"","","",{"$error":"#VALUE!"},{"$error":"#VALUE!"},"","",{"$error":"#VALUE!"},{"$f":"SUM($H$20:$H90)","v":0}]
[{"$f":"IF(Values_Entered,A90+1,\"\")","v":""},"","","",{"$error":"#VALUE!"},{"$error":"#VALUE!"},"","",{"$error":"#VALUE!"},{"$f":"SUM($H$20:$H91)","v":0}]
[{"$f":"IF(Values_Entered,A91+1,\"\")","v":""},"","","",{"$error":"#VALUE!"},{"$error":"#VALUE!"},"","",{"$error":"#VALUE!"},{"$f":"SUM($H$20:$H92)","v":0}]
[{"$f":"IF(Values_Entered,A92+1,\"\")","v":""},"","","",{"$error":"#VALUE!"},{"$error":"#VALUE!"},"","",{"$error":"#VALUE!"},{"$f":"SUM($H$20:$H93)","v":0}]
[{"$f":"IF(Values_Entered,A93+1,\"\")","v":""},"","","",{"$error":"#VALUE!"},{"$error":"#VALUE!"},"","",{"$error":"#VALUE!"},{"$f":"SUM($H$20:$H94)","v":0}]
[{"$f":"IF(Values_Entered,A94+1,\"\")","v":""},"","","",{"$error":"#VALUE!"},{"$error":"#VALUE!"},"","",{"$error":"#VALUE!"},{"$f":"SUM($H$20:$H95)","v":0}]
[{"$f":"IF(Values_Entered,A95+1,\"\")","v":""},"","","",{"$error":"#VALUE!"},{"$error":"#VALUE!"},"","",{"$error":"#VALUE!"},{"$f":"SUM($H$20:$H96)","v":0}]
[{"$f":"IF(Values_Entered,A96+1,\"\")","v":""},"","","",{"$error":"#VALUE!"},{"$error":"#VALUE!"},"","",{"$error":"#VALUE!"},{"$f":"SUM($H$20:$H97)","v":0}]
[{"$f":"IF(Values_Entered,A97+1,\"\")","v":""},"","","",{"$error":"#VALUE!"},{"$error":"#VALUE!"},"","",{"$error":"#VALUE!"},{"$f":"SUM($H$20:$H98)","v":0}]
[{"$f":"IF(Values_Entered,A98+1,\"\")","v":""},"","","",{"$error":"#VALUE!"},{"$error":"#VALUE!"},"","",{"$error":"#VALUE!"},{"$f":"SUM($H$20:$H99)","v":0}]
[{"$f":"IF(Values_Entered,A99+1,\"\")","v":""},"","","",{"$error":"#VALUE!"},{"$error":"#VALUE!"},"","",{"$error":"#VALUE!"},{"$f":"SUM($H$20:$H100)","v":0}]
[{"$f":"IF(Values_Entered,A100+1,\"\")","v":""},"","","",{"$error":"#VALUE!"},{"$error":"#VALUE!"},"","",{"$error":"#VALUE!"},{"$f":"SUM($H$20:$H101)","v":0}]
[{"$f":"IF(Values_Entered,A101+1,\"\")","v":""},"","","",{"$error":"#VALUE!"},{"$error":"#VALUE!"},"","",{"$error":"#VALUE!"},{"$f":"SUM($H$20:$H102)","v":0}]
[{"$f":"IF(Values_Entered,A102+1,\"\")","v":""},"","","",{"$error":"#VALUE!"},{"$error":"#VALUE!"},"","",{"$error":"#VALUE!"},{"$f":"SUM($H$20:$H103)","v":0}]
[{"$f":"IF(Values_Entered,A103+1,\"\")","v":""},"","","",{"$error":"#VALUE!"},{"$error":"#VALUE!"},"","",{"$error":"#VALUE!"},{"$f":"SUM($H$20:$H104)","v":0}]
[{"$f":"IF(Values_Entered,A104+1,\"\")","v":""},"","","",{"$error":"#VALUE!"},{"$error":"#VALUE!"},"","",{"$error":"#VALUE!"},{"$f":"SUM($H$20:$H105)","v":0}]
[{"$f":"IF(Values_Entered,A105+1,\"\")","v":""},"","","",{"$error":"#VALUE!"},{"$error":"#VALUE!"},"","",{"$error":"#VALUE!"},{"$f":"SUM($H$20:$H106)","v":0}]
[{"$f":"IF(Values_Entered,A106+1,\"\")","v":""},"","","",{"$error":"#VALUE!"},{"$error":"#VALUE!"},"","",{"$error":"#VALUE!"},{"$f":"SUM($H$20:$H107)","v":0}]
[{"$f":"IF(Values_Entered,A107+1,\"\")","v":""},"","","",{"$error":"#VALUE!"},{"$error":"#VALUE!"},"","",{"$error":"#VALUE!"},{"$f":"SUM($H$20:$H108)","v":0}]
[{"$f":"IF(Values_Entered,A108+1,\"\")","v":""},"","","",{"$error":"#VALUE!"},{"$error":"#VALUE!"},"","",{"$error":"#VALUE!"},{"$f":"SUM($H$20:$H109)","v":0}]
[{"$f":"IF(Values_Entered,A109+1,\"\")","v":""},"","","",{"$error":"#VALUE!"},{"$error":"#VALUE!"},"","",{"$error":"#VALUE!"},{"$f":"SUM($H$20:$H110)","v":0}]
[{"$f":"IF(Values_Entered,A110+1,\"\")","v":""},"","","",{"$error":"#VALUE!"},{"$error":"#VALUE!"},"","",{"$error":"#VALUE!"},{"$f":"SUM($H$20:$H111)","v":0}]
[{"$f":"IF(Values_Entered,A111+1,\"\")","v":""},"","","",{"$error":"#VALUE!"},{"$error":"#VALUE!"},"","",{"$error":"#VALUE!"},{"$f":"SUM($H$20:$H112)","v":0}]
[{"$f":"IF(Values_Entered,A112+1,\"\")","v":""},"","","",{"$error":"#VALUE!"},{"$error":"#VALUE!"},"","",{"$error":"#VALUE!"},{"$f":"SUM($H$20:$H113)","v":0}]
[{"$f":"IF(Values_Entered,A113+1,\"\")","v":""},"","","",{"$error":"#VALUE!"},{"$error":"#VALUE!"},"","",{"$error":"#VALUE!"},{"$f":"SUM($H$20:$H114)","v":0}]
[{"$f":"IF(Values_Entered,A114+1,\"\")","v":""},"","","",{"$error":"#VALUE!"},{"$error":"#VALUE!"},"","",{"$error":"#VALUE!"},{"$f":"SUM($H$20:$H115)","v":0}]
[{"$f":"IF(Values_Entered,A115+1,\"\")","v":""},"","","",{"$error":"#VALUE!"},{"$error":"#VALUE!"},"","",{"$error":"#VALUE!"},{"$f":"SUM($H$20:$H116)","v":0}]
[{"$f":"IF(Values_Entered,A116+1,\"\")","v":""},"","","",{"$error":"#VALUE!"},{"$error":"#VALUE!"},"","",{"$error":"#VALUE!"},{"$f":"SUM($H$20:$H117)","v":0}]
[{"$f":"IF(Values_Entered,A117+1,\"\")","v":""},"","","",{"$error":"#VALUE!"},{"$error":"#VALUE!"},"","",{"$error":"#VALUE!"},{"$f":"SUM($H$20:$H118)","v":0}]
[{"$f":"IF(Values_Entered,A118+1,\"\")","v":""},"","","",{"$error":"#VALUE!"},{"$error":"#VALUE!"},"","",{"$error":"#VALUE!"},{"$f":"SUM($H$20:$H119)","v":0}]
[{"$f":"IF(Values_Entered,A119+1,\"\")","v":""},"","","",{"$error":"#VALUE!"},{"$error":"#VALUE!"},"","",{"$error":"#VALUE!"},{"$f":"SUM($H$20:$H120)","v":0}]
[{"$f":"IF(Values_Entered,A120+1,\"\")","v":""},"","","",{"$error":"#VALUE!"},{"$error":"#VALUE!"},"","",{"$error":"#VALUE!"},{"$f":"SUM($H$20:$H121)","v":0}]
[{"$f":"IF(Values_Entered,A121+1,\"\")","v":""},"","","",{"$error":"#VALUE!"},{"$error":"#VALUE!"},"","",{"$error":"#VALUE!"},{"$f":"SUM($H$20:$H122)","v":0}]
[{"$f":"IF(Values_Entered,A122+1,\"\")","v":""},"","","",{"$error":"#VALUE!"},{"$error":"#VALUE!"},"","",{"$error":"#VALUE!"},{"$f":"SUM($H$20:$H123)","v":0}]
[{"$f":"IF(Values_Entered,A123+1,\"\")","v":""},"","","",{"$error":"#VALUE!"},{"$error":"#VALUE!"},"","",{"$error":"#VALUE!"},{"$f":"SUM($H$20:$H124)","v":0}]
[{"$f":"IF(Values_Entered,A124+1,\"\")","v":""},"","","",{"$error":"#VALUE!"},{"$error":"#VALUE!"},"","",{"$error":"#VALUE!"},{"$f":"SUM($H$20:$H125)","v":0}]
[{"$f":"IF(Values_Entered,A125+1,\"\")","v":""},"","","",{"$error":"#VALUE!"},{"$error":"#VALUE!"},"","",{"$error":"#VALUE!"},{"$f":"SUM($H$20:$H126)","v":0}]
[{"$f":"IF(Values_Entered,A126+1,\"\")","v":""},"","","",{"$error":"#VALUE!"},{"$error":"#VALUE!"},"","",{"$error":"#VALUE!"},{"$f":"SUM($H$20:$H127)","v":0}]
[{"$f":"IF(Values_Entered,A127+1,\"\")","v":""},"","","",{"$error":"#VALUE!"},{"$error":"#VALUE!"},"","",{"$error":"#VALUE!"},{"$f":"SUM($H$20:$H128)","v":0}]
[{"$f":"IF(Values_Entered,A128+1,\"\")","v":""},"","","",{"$error":"#VALUE!"},{"$error":"#VALUE!"},"","",{"$error":"#VALUE!"},{"$f":"SUM($H$20:$H129)","v":0}]
[{"$f":"IF(Values_Entered,A129+1,\"\")","v":""},"","","",{"$error":"#VALUE!"},{"$error":"#VALUE!"},"","",{"$error":"#VALUE!"},{"$f":"SUM($H$20:$H130)","v":0}]
[{"$f":"IF(Values_Entered,A130+1,\"\")","v":""},"","","",{"$error":"#VALUE!"},{"$error":"#VALUE!"},"","",{"$error":"#VALUE!"},{"$f":"SUM($H$20:$H131)","v":0}]
[{"$f":"IF(Values_Entered,A131+1,\"\")","v":""},"","","",{"$error":"#VALUE!"},{"$error":"#VALUE!"},"","",{"$error":"#VALUE!"},{"$f":"SUM($H$20:$H132)","v":0}]
[{"$f":"IF(Values_Entered,A132+1,\"\")","v":""},"","","",{"$error":"#VALUE!"},{"$error":"#VALUE!"},"","",{"$error":"#VALUE!"},{"$f":"SUM($H$20:$H133)","v":0}]
[{"$f":"IF(Values_Entered,A133+1,\"\")","v":""},"","","",{"$error":"#VALUE!"},{"$error":"#VALUE!"},"","",{"$error":"#VALUE!"},{"$f":"SUM($H$20:$H134)","v":0}]
[{"$f":"IF(Values_Entered,A134+1,\"\")","v":""},"","","",{"$error":"#VALUE!"},{"$error":"#VALUE!"},"","",{"$error":"#VALUE!"},{"$f":"SUM($H$20:$H135)","v":0}]
[{"$f":"IF(Values_Entered,A135+1,\"\")","v":""},"","","",{"$error":"#VALUE!"},{"$error":"#VALUE!"},"","",{"$error":"#VALUE!"},{"$f":"SUM($H$20:$H136)","v":0}]
[{"$f":"IF(Values_Entered,A136+1,\"\")","v":""},"","","",{"$error":"#VALUE!"},{"$error":"#VALUE!"},"","",{"$error":"#VALUE!"},{"$f":"SUM($H$20:$H137)","v":0}]
[{"$f":"IF(Values_Entered,A137+1,\"\")","v":""},"","","",{"$error":"#VALUE!"},{"$error":"#VALUE!"},"","",{"$error":"#VALUE!"},{"$f":"SUM($H$20:$H138)","v":0}]
[{"$f":"IF(Values_Entered,A138+1,\"\")","v":""},"","","",{"$error":"#VALUE!"},{"$error":"#VALUE!"},"","",{"$error":"#VALUE!"},{"$f":"SUM($H$20:$H139)","v":0}]
[{"$f":"IF(Values_Entered,A139+1,\"\")","v":""},"","","",{"$error":"#VALUE!"},{"$error":"#VALUE!"},"","",{"$error":"#VALUE!"},{"$f":"SUM($H$20:$H140)","v":0}]
[{"$f":"IF(Values_Entered,A140+1,\"\")","v":""},"","","",{"$error":"#VALUE!"},{"$error":"#VALUE!"},"","",{"$error":"#VALUE!"},{"$f":"SUM($H$20:$H141)","v":0}]
[{"$f":"IF(Values_Entered,A141+1,\"\")","v":""},"","","",{"$error":"#VALUE!"},{"$error":"#VALUE!"},"","",{"$error":"#VALUE!"},{"$f":"SUM($H$20:$H142)","v":0}]
[{"$f":"IF(Values_Entered,A142+1,\"\")","v":""},"","","",{"$error":"#VALUE!"},{"$error":"#VALUE!"},"","",{"$error":"#VALUE!"},{"$f":"SUM($H$20:$H143)","v":0}]
[{"$f":"IF(Values_Entered,A143+1,\"\")","v":""},"","","",{"$error":"#VALUE!"},{"$error":"#VALUE!"},"","",{"$error":"#VALUE!"},{"$f":"SUM($H$20:$H144)","v":0}]
[{"$f":"IF(Values_Entered,A144+1,\"\")","v":""},"","","",{"$error":"#VALUE!"},{"$error":"#VALUE!"},"","",{"$error":"#VALUE!"},{"$f":"SUM($H$20:$H145)","v":0}]
[{"$f":"IF(Values_Entered,A145+1,\"\")","v":""},"","","",{"$error":"#VALUE!"},{"$error":"#VALUE!"},"","",{"$error":"#VALUE!"},{"$f":"SUM($H$20:$H146)","v":0}]
[{"$f":"IF(Values_Entered,A146+1,\"\")","v":""},"","","",{"$error":"#VALUE!"},{"$error":"#VALUE!"},"","",{"$error":"#VALUE!"},{"$f":"SUM($H$20:$H147)","v":0}]
[{"$f":"IF(Values_Entered,A147+1,\"\")","v":""},{"$f":"IF(Pay_Num<>\"\",DATE(YEAR(Loan_Start),MONTH(Loan_Start)+(Pay_Num)*12/Num_Pmt_Per_Year,DAY(Loan_Start)),\"\")","v":""},"","",{"$f":"IF(AND(Pay_Num<>\"\",Sched_Pay+Scheduled_Extra_Payments<Beg_Bal),Scheduled_Extra_Payments,IF(AND(Pay_Num<>\"\",Beg_Bal-Sched_Pay>0),Beg_Bal-Sched_Pay,IF(Pay_Num<>\"\",0,\"\")))","v":{"$error":"#VALUE!"}},{"$f":"IF(AND(Pay_Num<>\"\",Sched_Pay+Extra_Pay<Beg_Bal),Sched_Pay+Extra_Pay,IF(Pay_Num<>\"\",Beg_Bal,\"\"))","v":{"$error":"#VALUE!"}},"","",{"$f":"IF(AND(Pay_Num<>\"\",Sched_Pay+Extra_Pay<Beg_Bal),Beg_Bal-Princ,IF(Pay_Num<>\"\",0,\"\"))","v":{"$error":"#VALUE!"}},{"$f":"SUM($H$20:$H148)","v":0}]
[{"$f":"IF(Values_Entered,A148+1,\"\")","v":""},"",{"$f":"IF(Pay_Num<>\"\",I148,\"\")","v":""},"",{"$error":"#VALUE!"},{"$error":"#VALUE!"},{"$f":"IF(Pay_Num<>\"\",Total_Pay-Int,\"\")","v":""},{"$f":"IF(Pay_Num<>\"\",Beg_Bal*Interest_Rate/Num_Pmt_Per_Year,\"\")","v":""},{"$error":"#VALUE!"},{"$f":"SUM($H$20:$H149)","v":0}]
[{"$f":"IF(Values_Entered,A149+1,\"\")","v":""},"","",{"$f":"IF(Pay_Num<>\"\",Scheduled_Monthly_Payment,\"\")","v":""},{"$error":"#VALUE!"},{"$error":"#VALUE!"},"","",{"$error":"#VALUE!"},{"$f":"SUM($H$20:$H150)","v":0}]
[{"$f":"IF(Values_Entered,A150+1,\"\")","v":""},"","","",{"$error":"#VALUE!"},{"$error":"#VALUE!"},"","",{"$error":"#VALUE!"},{"$f":"SUM($H$20:$H151)","v":0}]
[{"$f":"IF(Values_Entered,A151+1,\"\")","v":""},"","","",{"$error":"#VALUE!"},{"$error":"#VALUE!"},"","",{"$error":"#VALUE!"},{"$f":"SUM($H$20:$H152)","v":0}]
[{"$f":"IF(Values_Entered,A152+1,\"\")","v":""},"","","",{"$error":"#VALUE!"},{"$error":"#VALUE!"},"","",{"$error":"#VALUE!"},{"$f":"SUM($H$20:$H153)","v":0}]
[{"$f":"IF(Values_Entered,A153+1,\"\")","v":""},"","","",{"$error":"#VALUE!"},{"$error":"#VALUE!"},"","",{"$error":"#VALUE!"},{"$f":"SUM($H$20:$H154)","v":0}]
[{"$f":"IF(Values_Entered,A154+1,\"\")","v":""},"","","",{"$error":"#VALUE!"},{"$error":"#VALUE!"},"","",{"$error":"#VALUE!"},{"$f":"SUM($H$20:$H155)","v":0}]
[{"$f":"IF(Values_Entered,A155+1,\"\")","v":""},"","","",{"$error":"#VALUE!"},{"$error":"#VALUE!"},"","",{"$error":"#VALUE!"},{"$f":"SUM($H$20:$H156)","v":0}]
[{"$f":"IF(Values_Entered,A156+1,\"\")","v":""},"","","",{"$error":"#VALUE!"},{"$error":"#VALUE!"},"","",{"$error":"#VALUE!"},{"$f":"SUM($H$20:$H157)","v":0}]
[{"$f":"IF(Values_Entered,A157+1,\"\")","v":""},"","","",{"$error":"#VALUE!"},{"$error":"#VALUE!"},"","",{"$error":"#VALUE!"},{"$f":"SUM($H$20:$H158)","v":0}]
[{"$f":"IF(Values_Entered,A158+1,\"\")","v":""},"","","",{"$error":"#VALUE!"},{"$error":"#VALUE!"},"","",{"$error":"#VALUE!"},{"$f":"SUM($H$20:$H159)","v":0}]
[{"$f":"IF(Values_Entered,A159+1,\"\")","v":""},"","","",{"$error":"#VALUE!"},{"$error":"#VALUE!"},"","",{"$error":"#VALUE!"},{"$f":"SUM($H$20:$H160)","v":0}]
[{"$f":"IF(Values_Entered,A160+1,\"\")","v":""},"","","",{"$error":"#VALUE!"},{"$error":"#VALUE!"},"","",{"$error":"#VALUE!"},{"$f":"SUM($H$20:$H161)","v":0}]
[{"$f":"IF(Values_Entered,A161+1,\"\")","v":""},"","","",{"$error":"#VALUE!"},{"$error":"#VALUE!"},"","",{"$error":"#VALUE!"},{"$f":"SUM($H$20:$H162)","v":0}]
[{"$f":"IF(Values_Entered,A162+1,\"\")","v":""},"","","",{"$error":"#VALUE!"},{"$error":"#VALUE!"},"","",{"$error":"#VALUE!"},{"$f":"SUM($H$20:$H163)","v":0}]
[{"$f":"IF(Values_Entered,A163+1,\"\")","v":""},"","","",{"$error":"#VALUE!"},{"$error":"#VALUE!"},"","",{"$error":"#VALUE!"},{"$f":"SUM($H$20:$H164)","v":0}]
[{"$f":"IF(Values_Entered,A164+1,\"\")","v":""},"","","",{"$error":"#VALUE!"},{"$error":"#VALUE!"},"","",{"$error":"#VALUE!"},{"$f":"SUM($H$20:$H165)","v":0}]
[{"$f":"IF(Values_Entered,A165+1,\"\")","v":""},"","","",{"$error":"#VALUE!"},{"$error":"#VALUE!"},"","",{"$error":"#VALUE!"},{"$f":"SUM($H$20:$H166)","v":0}]
[{"$f":"IF(Values_Entered,A166+1,\"\")","v":""},"","","",{"$error":"#VALUE!"},{"$error":"#VALUE!"},"","",{"$error":"#VALUE!"},{"$f":"SUM($H$20:$H167)","v":0}]
[{"$f":"IF(Values_Entered,A167+1,\"\")","v":""},"","","",{"$error":"#VALUE!"},{"$error":"#VALUE!"},"","",{"$error":"#VALUE!"},{"$f":"SUM($H$20:$H168)","v":0}]
[{"$f":"IF(Values_Entered,A168+1,\"\")","v":""},"","","",{"$error":"#VALUE!"},{"$error":"#VALUE!"},"","",{"$error":"#VALUE!"},{"$f":"SUM($H$20:$H169)","v":0}]
[{"$f":"IF(Values_Entered,A169+1,\"\")","v":""},"","","",{"$error":"#VALUE!"},{"$error":"#VALUE!"},"","",{"$error":"#VALUE!"},{"$f":"SUM($H$20:$H170)","v":0}]
[{"$f":"IF(Values_Entered,A170+1,\"\")","v":""},"","","",{"$error":"#VALUE!"},{"$error":"#VALUE!"},"","",{"$error":"#VALUE!"},{"$f":"SUM($H$20:$H171)","v":0}]
[{"$f":"IF(Values_Entered,A171+1,\"\")","v":""},"","","",{"$error":"#VALUE!"},{"$error":"#VALUE!"},"","",{"$error":"#VALUE!"},{"$f":"SUM($H$20:$H172)","v":0}]
[{"$f":"IF(Values_Entered,A172+1,\"\")","v":""},"","","",{"$error":"#VALUE!"},{"$error":"#VALUE!"},"","",{"$error":"#VALUE!"},{"$f":"SUM($H$20:$H173)","v":0}]
[{"$f":"IF(Values_Entered,A173+1,\"\")","v":""},"","","",{"$error":"#VALUE!"},{"$error":"#VALUE!"},"","",{"$error":"#VALUE!"},{"$f":"SUM($H$20:$H174)","v":0}]
[{"$f":"IF(Values_Entered,A174+1,\"\")","v":""},"","","",{"$error":"#VALUE!"},{"$error":"#VALUE!"},"","",{"$error":"#VALUE!"},{"$f":"SUM($H$20:$H175)","v":0}]
[{"$f":"IF(Values_Entered,A175+1,\"\")","v":""},"","","",{"$error":"#VALUE!"},{"$error":"#VALUE!"},"","",{"$error":"#VALUE!"},{"$f":"SUM($H$20:$H176)","v":0}]
[{"$f":"IF(Values_Entered,A176+1,\"\")","v":""},"","","",{"$error":"#VALUE!"},{"$error":"#VALUE!"},"","",{"$error":"#VALUE!"},{"$f":"SUM($H$20:$H177)","v":0}]
[{"$f":"IF(Values_Entered,A177+1,\"\")","v":""},"","","",{"$error":"#VALUE!"},{"$error":"#VALUE!"},"","",{"$error":"#VALUE!"},{"$f":"SUM($H$20:$H178)","v":0}]
[{"$f":"IF(Values_Entered,A178+1,\"\")","v":""},"","","",{"$error":"#VALUE!"},{"$error":"#VALUE!"},"","",{"$error":"#VALUE!"},{"$f":"SUM($H$20:$H179)","v":0}]
[{"$f":"IF(Values_Entered,A179+1,\"\")","v":""},"","","",{"$error":"#VALUE!"},{"$error":"#VALUE!"},"","",{"$error":"#VALUE!"},{"$f":"SUM($H$20:$H180)","v":0}]
[{"$f":"IF(Values_Entered,A180+1,\"\")","v":""},"","","",{"$error":"#VALUE!"},{"$error":"#VALUE!"},"","",{"$error":"#VALUE!"},{"$f":"SUM($H$20:$H181)","v":0}]
[{"$f":"IF(Values_Entered,A181+1,\"\")","v":""},"","","",{"$error":"#VALUE!"},{"$error":"#VALUE!"},"","",{"$error":"#VALUE!"},{"$f":"SUM($H$20:$H182)","v":0}]
[{"$f":"IF(Values_Entered,A182+1,\"\")","v":""},"","","",{"$error":"#VALUE!"},{"$error":"#VALUE!"},"","",{"$error":"#VALUE!"},{"$f":"SUM($H$20:$H183)","v":0}]
[{"$f":"IF(Values_Entered,A183+1,\"\")","v":""},"","","",{"$error":"#VALUE!"},{"$error":"#VALUE!"},"","",{"$error":"#VALUE!"},{"$f":"SUM($H$20:$H184)","v":0}]
[{"$f":"IF(Values_Entered,A184+1,\"\")","v":""},"","","",{"$error":"#VALUE!"},{"$error":"#VALUE!"},"","",{"$error":"#VALUE!"},{"$f":"SUM($H$20:$H185)","v":0}]
[{"$f":"IF(Values_Entered,A185+1,\"\")","v":""},"","","",{"$error":"#VALUE!"},{"$error":"#VALUE!"},"","",{"$error":"#VALUE!"},{"$f":"SUM($H$20:$H186)","v":0}]
[{"$f":"IF(Values_Entered,A186+1,\"\")","v":""},"","","",{"$error":"#VALUE!"},{"$error":"#VALUE!"},"","",{"$error":"#VALUE!"},{"$f":"SUM($H$20:$H187)","v":0}]
[{"$f":"IF(Values_Entered,A187+1,\"\")","v":""},"","","",{"$error":"#VALUE!"},{"$error":"#VALUE!"},"","",{"$error":"#VALUE!"},{"$f":"SUM($H$20:$H188)","v":0}]
[{"$f":"IF(Values_Entered,A188+1,\"\")","v":""},"","","",{"$error":"#VALUE!"},{"$error":"#VALUE!"},"","",{"$error":"#VALUE!"},{"$f":"SUM($H$20:$H189)","v":0}]
[{"$f":"IF(Values_Entered,A189+1,\"\")","v":""},"","","",{"$error":"#VALUE!"},{"$error":"#VALUE!"},"","",{"$error":"#VALUE!"},{"$f":"SUM($H$20:$H190)","v":0}]
[{"$f":"IF(Values_Entered,A190+1,\"\")","v":""},"","","",{"$error":"#VALUE!"},{"$error":"#VALUE!"},"","",{"$error":"#VALUE!"},{"$f":"SUM($H$20:$H191)","v":0}]
[{"$f":"IF(Values_Entered,A191+1,\"\")","v":""},"","","",{"$error":"#VALUE!"},{"$error":"#VALUE!"},"","",{"$error":"#VALUE!"},{"$f":"SUM($H$20:$H192)","v":0}]
[{"$f":"IF(Values_Entered,A192+1,\"\")","v":""},"","","",{"$error":"#VALUE!"},{"$error":"#VALUE!"},"","",{"$error":"#VALUE!"},{"$f":"SUM($H$20:$H193)","v":0}]
[{"$f":"IF(Values_Entered,A193+1,\"\")","v":""},"","","",{"$error":"#VALUE!"},{"$error":"#VALUE!"},"","",{"$error":"#VALUE!"},{"$f":"SUM($H$20:$H194)","v":0}]
[{"$f":"IF(Values_Entered,A194+1,\"\")","v":""},"","","",{"$error":"#VALUE!"},{"$error":"#VALUE!"},"","",{"$error":"#VALUE!"},{"$f":"SUM($H$20:$H195)","v":0}]
[{"$f":"IF(Values_Entered,A195+1,\"\")","v":""},"","","",{"$error":"#VALUE!"},{"$error":"#VALUE!"},"","",{"$error":"#VALUE!"},{"$f":"SUM($H$20:$H196)","v":0}]
[{"$f":"IF(Values_Entered,A196+1,\"\")","v":""},"","","",{"$error":"#VALUE!"},{"$error":"#VALUE!"},"","",{"$error":"#VALUE!"},{"$f":"SUM($H$20:$H197)","v":0}]
[{"$f":"IF(Values_Entered,A197+1,\"\")","v":""},"","","",{"$error":"#VALUE!"},{"$error":"#VALUE!"},"","",{"$error":"#VALUE!"},{"$f":"SUM($H$20:$H198)","v":0}]
[{"$f":"IF(Values_Entered,A198+1,\"\")","v":""},"","","",{"$error":"#VALUE!"},{"$error":"#VALUE!"},"","",{"$error":"#VALUE!"},{"$f":"SUM($H$20:$H199)","v":0}]
[{"$f":"IF(Values_Entered,A199+1,\"\")","v":""},"","","",{"$error":"#VALUE!"},{"$error":"#VALUE!"},"","",{"$error":"#VALUE!"},{"$f":"SUM($H$20:$H200)","v":0}]
[{"$f":"IF(Values_Entered,A200+1,\"\")","v":""},"","","",{"$error":"#VALUE!"},{"$error":"#VALUE!"},"","",{"$error":"#VALUE!"},{"$f":"SUM($H$20:$H201)","v":0}]
[{"$f":"IF(Values_Entered,A201+1,\"\")","v":""},"","","",{"$error":"#VALUE!"},{"$error":"#VALUE!"},"","",{"$error":"#VALUE!"},{"$f":"SUM($H$20:$H202)","v":0}]
[{"$f":"IF(Values_Entered,A202+1,\"\")","v":""},"","","",{"$error":"#VALUE!"},{"$error":"#VALUE!"},"","",{"$error":"#VALUE!"},{"$f":"SUM($H$20:$H203)","v":0}]
[{"$f":"IF(Values_Entered,A203+1,\"\")","v":""},"","","",{"$error":"#VALUE!"},{"$error":"#VALUE!"},"","",{"$error":"#VALUE!"},{"$f":"SUM($H$20:$H204)","v":0}]
[{"$f":"IF(Values_Entered,A204+1,\"\")","v":""},"","","",{"$error":"#VALUE!"},{"$error":"#VALUE!"},"","",{"$error":"#VALUE!"},{"$f":"SUM($H$20:$H205)","v":0}]
[{"$f":"IF(Values_Entered,A205+1,\"\")","v":""},"","","",{"$error":"#VALUE!"},{"$error":"#VALUE!"},"","",{"$error":"#VALUE!"},{"$f":"SUM($H$20:$H206)","v":0}]
[{"$f":"IF(Values_Entered,A206+1,\"\")","v":""},"","","",{"$error":"#VALUE!"},{"$error":"#VALUE!"},"","",{"$error":"#VALUE!"},{"$f":"SUM($H$20:$H207)","v":0}]
[{"$f":"IF(Values_Entered,A207+1,\"\")","v":""},"","","",{"$error":"#VALUE!"},{"$error":"#VALUE!"},"","",{"$error":"#VALUE!"},{"$f":"SUM($H$20:$H208)","v":0}]
[{"$f":"IF(Values_Entered,A208+1,\"\")","v":""},"","","",{"$error":"#VALUE!"},{"$error":"#VALUE!"},"","",{"$error":"#VALUE!"},{"$f":"SUM($H$20:$H209)","v":0}]
[{"$f":"IF(Values_Entered,A209+1,\"\")","v":""},"","","",{"$error":"#VALUE!"},{"$error":"#VALUE!"},"","",{"$error":"#VALUE!"},{"$f":"SUM($H$20:$H210)","v":0}]
[{"$f":"IF(Values_Entered,A210+1,\"\")","v":""},"","","",{"$error":"#VALUE!"},{"$error":"#VALUE!"},"","",{"$error":"#VALUE!"},{"$f":"SUM($H$20:$H211)","v":0}]
[{"$f":"IF(Values_Entered,A211+1,\"\")","v":""},{"$f":"IF(Pay_Num<>\"\",DATE(YEAR(Loan_Start),MONTH(Loan_Start)+(Pay_Num)*12/Num_Pmt_Per_Year,DAY(Loan_Start)),\"\")","v":""},"","",{"$f":"IF(AND(Pay_Num<>\"\",Sched_Pay+Scheduled_Extra_Payments<Beg_Bal),Scheduled_Extra_Payments,IF(AND(Pay_Num<>\"\",Beg_Bal-Sched_Pay>0),Beg_Bal-Sched_Pay,IF(Pay_Num<>\"\",0,\"\")))","v":{"$error":"#VALUE!"}},{"$f":"IF(AND(Pay_Num<>\"\",Sched_Pay+Extra_Pay<Beg_Bal),Sched_Pay+Extra_Pay,IF(Pay_Num<>\"\",Beg_Bal,\"\"))","v":{"$error":"#VALUE!"}},"","",{"$f":"IF(AND(Pay_Num<>\"\",Sched_Pay+Extra_Pay<Beg_Bal),Beg_Bal-Princ,IF(Pay_Num<>\"\",0,\"\"))","v":{"$error":"#VALUE!"}},{"$f":"SUM($H$20:$H212)","v":0}]
[{"$f":"IF(Values_Entered,A212+1,\"\")","v":""},"",{"$f":"IF(Pay_Num<>\"\",I212,\"\")","v":""},"",{"$error":"#VALUE!"},{"$error":"#VALUE!"},{"$f":"IF(Pay_Num<>\"\",Total_Pay-Int,\"\")","v":""},{"$f":"IF(Pay_Num<>\"\",Beg_Bal*Interest_Rate/Num_Pmt_Per_Year,\"\")","v":""},{"$error":"#VALUE!"},{"$f":"SUM($H$20:$H213)","v":0}]
[{"$f":"IF(Values_Entered,A213+1,\"\")","v":""},"","",{"$f":"IF(Pay_Num<>\"\",Scheduled_Monthly_Payment,\"\")","v":""},{"$error":"#VALUE!"},{"$error":"#VALUE!"},"","",{"$error":"#VALUE!"},{"$f":"SUM($H$20:$H214)","v":0}]
[{"$f":"IF(Values_Entered,A214+1,\"\")","v":""},"","","",{"$error":"#VALUE!"},{"$error":"#VALUE!"},"","",{"$error":"#VALUE!"},{"$f":"SUM($H$20:$H215)","v":0}]
[{"$f":"IF(Values_Entered,A215+1,\"\")","v":""},"","","",{"$error":"#VALUE!"},{"$error":"#VALUE!"},"","",{"$error":"#VALUE!"},{"$f":"SUM($H$20:$H216)","v":0}]
[{"$f":"IF(Values_Entered,A216+1,\"\")","v":""},"","","",{"$error":"#VALUE!"},{"$error":"#VALUE!"},"","",{"$error":"#VALUE!"},{"$f":"SUM($H$20:$H217)","v":0}]
[{"$f":"IF(Values_Entered,A217+1,\"\")","v":""},"","","",{"$error":"#VALUE!"},{"$error":"#VALUE!"},"","",{"$error":"#VALUE!"},{"$f":"SUM($H$20:$H218)","v":0}]
[{"$f":"IF(Values_Entered,A218+1,\"\")","v":""},"","","",{"$error":"#VALUE!"},{"$error":"#VALUE!"},"","",{"$error":"#VALUE!"},{"$f":"SUM($H$20:$H219)","v":0}]
[{"$f":"IF(Values_Entered,A219+1,\"\")","v":""},"","","",{"$error":"#VALUE!"},{"$error":"#VALUE!"},"","",{"$error":"#VALUE!"},{"$f":"SUM($H$20:$H220)","v":0}]
[{"$f":"IF(Values_Entered,A220+1,\"\")","v":""},"","","",{"$error":"#VALUE!"},{"$error":"#VALUE!"},"","",{"$error":"#VALUE!"},{"$f":"SUM($H$20:$H221)","v":0}]
[{"$f":"IF(Values_Entered,A221+1,\"\")","v":""},"","","",{"$error":"#VALUE!"},{"$error":"#VALUE!"},"","",{"$error":"#VALUE!"},{"$f":"SUM($H$20:$H222)","v":0}]
[{"$f":"IF(Values_Entered,A222+1,\"\")","v":""},"","","",{"$error":"#VALUE!"},{"$error":"#VALUE!"},"","",{"$error":"#VALUE!"},{"$f":"SUM($H$20:$H223)","v":0}]
[{"$f":"IF(Values_Entered,A223+1,\"\")","v":""},"","","",{"$error":"#VALUE!"},{"$error":"#VALUE!"},"","",{"$error":"#VALUE!"},{"$f":"SUM($H$20:$H224)","v":0}]
[{"$f":"IF(Values_Entered,A224+1,\"\")","v":""},"","","",{"$error":"#VALUE!"},{"$error":"#VALUE!"},"","",{"$error":"#VALUE!"},{"$f":"SUM($H$20:$H225)","v":0}]
[{"$f":"IF(Values_Entered,A225+1,\"\")","v":""},"","","",{"$error":"#VALUE!"},{"$error":"#VALUE!"},"","",{"$error":"#VALUE!"},{"$f":"SUM($H$20:$H226)","v":0}]
[{"$f":"IF(Values_Entered,A226+1,\"\")","v":""},"","","",{"$error":"#VALUE!"},{"$error":"#VALUE!"},"","",{"$error":"#VALUE!"},{"$f":"SUM($H$20:$H227)","v":0}]
[{"$f":"IF(Values_Entered,A227+1,\"\")","v":""},"","","",{"$error":"#VALUE!"},{"$error":"#VALUE!"},"","",{"$error":"#VALUE!"},{"$f":"SUM($H$20:$H228)","v":0}]
[{"$f":"IF(Values_Entered,A228+1,\"\")","v":""},"","","",{"$error":"#VALUE!"},{"$error":"#VALUE!"},"","",{"$error":"#VALUE!"},{"$f":"SUM($H$20:$H229)","v":0}]
[{"$f":"IF(Values_Entered,A229+1,\"\")","v":""},"","","",{"$error":"#VALUE!"},{"$error":"#VALUE!"},"","",{"$error":"#VALUE!"},{"$f":"SUM($H$20:$H230)","v":0}]
[{"$f":"IF(Values_Entered,A230+1,\"\")","v":""},"","","",{"$error":"#VALUE!"},{"$error":"#VALUE!"},"","",{"$error":"#VALUE!"},{"$f":"SUM($H$20:$H231)","v":0}]
[{"$f":"IF(Values_Entered,A231+1,\"\")","v":""},"","","",{"$error":"#VALUE!"},{"$error":"#VALUE!"},"","",{"$error":"#VALUE!"},{"$f":"SUM($H$20:$H232)","v":0}]
[{"$f":"IF(Values_Entered,A232+1,\"\")","v":""},"","","",{"$error":"#VALUE!"},{"$error":"#VALUE!"},"","",{"$error":"#VALUE!"},{"$f":"SUM($H$20:$H233)","v":0}]
[{"$f":"IF(Values_Entered,A233+1,\"\")","v":""},"","","",{"$error":"#VALUE!"},{"$error":"#VALUE!"},"","",{"$error":"#VALUE!"},{"$f":"SUM($H$20:$H234)","v":0}]
[{"$f":"IF(Values_Entered,A234+1,\"\")","v":""},"","","",{"$error":"#VALUE!"},{"$error":"#VALUE!"},"","",{"$error":"#VALUE!"},{"$f":"SUM($H$20:$H235)","v":0}]
[{"$f":"IF(Values_Entered,A235+1,\"\")","v":""},"","","",{"$error":"#VALUE!"},{"$error":"#VALUE!"},"","",{"$error":"#VALUE!"},{"$f":"SUM($H$20:$H236)","v":0}]
[{"$f":"IF(Values_Entered,A236+1,\"\")","v":""},"","","",{"$error":"#VALUE!"},{"$error":"#VALUE!"},"","",{"$error":"#VALUE!"},{"$f":"SUM($H$20:$H237)","v":0}]
[{"$f":"IF(Values_Entered,A237+1,\"\")","v":""},"","","",{"$error":"#VALUE!"},{"$error":"#VALUE!"},"","",{"$error":"#VALUE!"},{"$f":"SUM($H$20:$H238)","v":0}]
[{"$f":"IF(Values_Entered,A238+1,\"\")","v":""},"","","",{"$error":"#VALUE!"},{"$error":"#VALUE!"},"","",{"$error":"#VALUE!"},{"$f":"SUM($H$20:$H239)","v":0}]
[{"$f":"IF(Values_Entered,A239+1,\"\")","v":""},"","","",{"$error":"#VALUE!"},{"$error":"#VALUE!"},"","",{"$error":"#VALUE!"},{"$f":"SUM($H$20:$H240)","v":0}]
[{"$f":"IF(Values_Entered,A240+1,\"\")","v":""},"","","",{"$error":"#VALUE!"},{"$error":"#VALUE!"},"","",{"$error":"#VALUE!"},{"$f":"SUM($H$20:$H241)","v":0}]
[{"$f":"IF(Values_Entered,A241+1,\"\")","v":""},"","","",{"$error":"#VALUE!"},{"$error":"#VALUE!"},"","",{"$error":"#VALUE!"},{"$f":"SUM($H$20:$H242)","v":0}]
[{"$f":"IF(Values_Entered,A242+1,\"\")","v":""},"","","",{"$error":"#VALUE!"},{"$error":"#VALUE!"},"","",{"$error":"#VALUE!"},{"$f":"SUM($H$20:$H243)","v":0}]
[{"$f":"IF(Values_Entered,A243+1,\"\")","v":""},"","","",{"$error":"#VALUE!"},{"$error":"#VALUE!"},"","",{"$error":"#VALUE!"},{"$f":"SUM($H$20:$H244)","v":0}]
[{"$f":"IF(Values_Entered,A244+1,\"\")","v":""},"","","",{"$error":"#VALUE!"},{"$error":"#VALUE!"},"","",{"$error":"#VALUE!"},{"$f":"SUM($H$20:$H245)","v":0}]
[{"$f":"IF(Values_Entered,A245+1,\"\")","v":""},"","","",{"$error":"#VALUE!"},{"$error":"#VALUE!"},"","",{"$error":"#VALUE!"},{"$f":"SUM($H$20:$H246)","v":0}]
[{"$f":"IF(Values_Entered,A246+1,\"\")","v":""},"","","",{"$error":"#VALUE!"},{"$error":"#VALUE!"},"","",{"$error":"#VALUE!"},{"$f":"SUM($H$20:$H247)","v":0}]
[{"$f":"IF(Values_Entered,A247+1,\"\")","v":""},"","","",{"$error":"#VALUE!"},{"$error":"#VALUE!"},"","",{"$error":"#VALUE!"},{"$f":"SUM($H$20:$H248)","v":0}]
[{"$f":"IF(Values_Entered,A248+1,\"\")","v":""},"","","",{"$error":"#VALUE!"},{"$error":"#VALUE!"},"","",{"$error":"#VALUE!"},{"$f":"SUM($H$20:$H249)","v":0}]
[{"$f":"IF(Values_Entered,A249+1,\"\")","v":""},"","","",{"$error":"#VALUE!"},{"$error":"#VALUE!"},"","",{"$error":"#VALUE!"},{"$f":"SUM($H$20:$H250)","v":0}]
[{"$f":"IF(Values_Entered,A250+1,\"\")","v":""},"","","",{"$error":"#VALUE!"},{"$error":"#VALUE!"},"","",{"$error":"#VALUE!"},{"$f":"SUM($H$20:$H251)","v":0}]
[{"$f":"IF(Values_Entered,A251+1,\"\")","v":""},"","","",{"$error":"#VALUE!"},{"$error":"#VALUE!"},"","",{"$error":"#VALUE!"},{"$f":"SUM($H$20:$H252)","v":0}]
[{"$f":"IF(Values_Entered,A252+1,\"\")","v":""},"","","",{"$error":"#VALUE!"},{"$error":"#VALUE!"},"","",{"$error":"#VALUE!"},{"$f":"SUM($H$20:$H253)","v":0}]
[{"$f":"IF(Values_Entered,A253+1,\"\")","v":""},"","","",{"$error":"#VALUE!"},{"$error":"#VALUE!"},"","",{"$error":"#VALUE!"},{"$f":"SUM($H$20:$H254)","v":0}]
[{"$f":"IF(Values_Entered,A254+1,\"\")","v":""},"","","",{"$error":"#VALUE!"},{"$error":"#VALUE!"},"","",{"$error":"#VALUE!"},{"$f":"SUM($H$20:$H255)","v":0}]
[{"$f":"IF(Values_Entered,A255+1,\"\")","v":""},"","","",{"$error":"#VALUE!"},{"$error":"#VALUE!"},"","",{"$error":"#VALUE!"},{"$f":"SUM($H$20:$H256)","v":0}]
[{"$f":"IF(Values_Entered,A256+1,\"\")","v":""},"","","",{"$error":"#VALUE!"},{"$error":"#VALUE!"},"","",{"$error":"#VALUE!"},{"$f":"SUM($H$20:$H257)","v":0}]
[{"$f":"IF(Values_Entered,A257+1,\"\")","v":""},"","","",{"$error":"#VALUE!"},{"$error":"#VALUE!"},"","",{"$error":"#VALUE!"},{"$f":"SUM($H$20:$H258)","v":0}]
[{"$f":"IF(Values_Entered,A258+1,\"\")","v":""},"","","",{"$error":"#VALUE!"},{"$error":"#VALUE!"},"","",{"$error":"#VALUE!"},{"$f":"SUM($H$20:$H259)","v":0}]
[{"$f":"IF(Values_Entered,A259+1,\"\")","v":""},"","","",{"$error":"#VALUE!"},{"$error":"#VALUE!"},"","",{"$error":"#VALUE!"},{"$f":"SUM($H$20:$H260)","v":0}]
[{"$f":"IF(Values_Entered,A260+1,\"\")","v":""},"","","",{"$error":"#VALUE!"},{"$error":"#VALUE!"},"","",{"$error":"#VALUE!"},{"$f":"SUM($H$20:$H261)","v":0}]
[{"$f":"IF(Values_Entered,A261+1,\"\")","v":""},"","","",{"$error":"#VALUE!"},{"$error":"#VALUE!"},"","",{"$error":"#VALUE!"},{"$f":"SUM($H$20:$H262)","v":0}]
[{"$f":"IF(Values_Entered,A262+1,\"\")","v":""},"","","",{"$error":"#VALUE!"},{"$error":"#VALUE!"},"","",{"$error":"#VALUE!"},{"$f":"SUM($H$20:$H263)","v":0}]
[{"$f":"IF(Values_Entered,A263+1,\"\")","v":""},"","","",{"$error":"#VALUE!"},{"$error":"#VALUE!"},"","",{"$error":"#VALUE!"},{"$f":"SUM($H$20:$H264)","v":0}]
[{"$f":"IF(Values_Entered,A264+1,\"\")","v":""},"","","",{"$error":"#VALUE!"},{"$error":"#VALUE!"},"","",{"$error":"#VALUE!"},{"$f":"SUM($H$20:$H265)","v":0}]
[{"$f":"IF(Values_Entered,A265+1,\"\")","v":""},"","","",{"$error":"#VALUE!"},{"$error":"#VALUE!"},"","",{"$error":"#VALUE!"},{"$f":"SUM($H$20:$H266)","v":0}]
[{"$f":"IF(Values_Entered,A266+1,\"\")","v":""},"","","",{"$error":"#VALUE!"},{"$error":"#VALUE!"},"","",{"$error":"#VALUE!"},{"$f":"SUM($H$20:$H267)","v":0}]
[{"$f":"IF(Values_Entered,A267+1,\"\")","v":""},"","","",{"$error":"#VALUE!"},{"$error":"#VALUE!"},"","",{"$error":"#VALUE!"},{"$f":"SUM($H$20:$H268)","v":0}]
[{"$f":"IF(Values_Entered,A268+1,\"\")","v":""},"","","",{"$error":"#VALUE!"},{"$error":"#VALUE!"},"","",{"$error":"#VALUE!"},{"$f":"SUM($H$20:$H269)","v":0}]
[{"$f":"IF(Values_Entered,A269+1,\"\")","v":""},"","","",{"$error":"#VALUE!"},{"$error":"#VALUE!"},"","",{"$error":"#VALUE!"},{"$f":"SUM($H$20:$H270)","v":0}]
[{"$f":"IF(Values_Entered,A270+1,\"\")","v":""},"","","",{"$error":"#VALUE!"},{"$error":"#VALUE!"},"","",{"$error":"#VALUE!"},{"$f":"SUM($H$20:$H271)","v":0}]
[{"$f":"IF(Values_Entered,A271+1,\"\")","v":""},"","","",{"$error":"#VALUE!"},{"$error":"#VALUE!"},"","",{"$error":"#VALUE!"},{"$f":"SUM($H$20:$H272)","v":0}]
[{"$f":"IF(Values_Entered,A272+1,\"\")","v":""},"","","",{"$error":"#VALUE!"},{"$error":"#VALUE!"},"","",{"$error":"#VALUE!"},{"$f":"SUM($H$20:$H273)","v":0}]
[{"$f":"IF(Values_Entered,A273+1,\"\")","v":""},"","","",{"$error":"#VALUE!"},{"$error":"#VALUE!"},"","",{"$error":"#VALUE!"},{"$f":"SUM($H$20:$H274)","v":0}]
[{"$f":"IF(Values_Entered,A274+1,\"\")","v":""},"","","",{"$error":"#VALUE!"},{"$error":"#VALUE!"},"","",{"$error":"#VALUE!"},{"$f":"SUM($H$20:$H275)","v":0}]
[{"$f":"IF(Values_Entered,A275+1,\"\")","v":""},{"$f":"IF(Pay_Num<>\"\",DATE(YEAR(Loan_Start),MONTH(Loan_Start)+(Pay_Num)*12/Num_Pmt_Per_Year,DAY(Loan_Start)),\"\")","v":""},"","",{"$f":"IF(AND(Pay_Num<>\"\",Sched_Pay+Scheduled_Extra_Payments<Beg_Bal),Scheduled_Extra_Payments,IF(AND(Pay_Num<>\"\",Beg_Bal-Sched_Pay>0),Beg_Bal-Sched_Pay,IF(Pay_Num<>\"\",0,\"\")))","v":{"$error":"#VALUE!"}},{"$f":"IF(AND(Pay_Num<>\"\",Sched_Pay+Extra_Pay<Beg_Bal),Sched_Pay+Extra_Pay,IF(Pay_Num<>\"\",Beg_Bal,\"\"))","v":{"$error":"#VALUE!"}},"","",{"$f":"IF(AND(Pay_Num<>\"\",Sched_Pay+Extra_Pay<Beg_Bal),Beg_Bal-Princ,IF(Pay_Num<>\"\",0,\"\"))","v":{"$error":"#VALUE!"}},{"$f":"SUM($H$20:$H276)","v":0}]
[{"$f":"IF(Values_Entered,A276+1,\"\")","v":""},"",{"$f":"IF(Pay_Num<>\"\",I276,\"\")","v":""},"",{"$error":"#VALUE!"},{"$error":"#VALUE!"},{"$f":"IF(Pay_Num<>\"\",Total_Pay-Int,\"\")","v":""},{"$f":"IF(Pay_Num<>\"\",Beg_Bal*Interest_Rate/Num_Pmt_Per_Year,\"\")","v":""},{"$error":"#VALUE!"},{"$f":"SUM($H$20:$H277)","v":0}]
[{"$f":"IF(Values_Entered,A277+1,\"\")","v":""},"","",{"$f":"IF(Pay_Num<>\"\",Scheduled_Monthly_Payment,\"\")","v":""},{"$error":"#VALUE!"},{"$error":"#VALUE!"},"","",{"$error":"#VALUE!"},{"$f":"SUM($H$20:$H278)","v":0}]
[{"$f":"IF(Values_Entered,A278+1,\"\")","v":""},"","","",{"$error":"#VALUE!"},{"$error":"#VALUE!"},"","",{"$error":"#VALUE!"},{"$f":"SUM($H$20:$H279)","v":0}]
[{"$f":"IF(Values_Entered,A279+1,\"\")","v":""},"","","",{"$error":"#VALUE!"},{"$error":"#VALUE!"},"","",{"$error":"#VALUE!"},{"$f":"SUM($H$20:$H280)","v":0}]
[{"$f":"IF(Values_Entered,A280+1,\"\")","v":""},"","","",{"$error":"#VALUE!"},{"$error":"#VALUE!"},"","",{"$error":"#VALUE!"},{"$f":"SUM($H$20:$H281)","v":0}]
[{"$f":"IF(Values_Entered,A281+1,\"\")","v":""},"","","",{"$error":"#VALUE!"},{"$error":"#VALUE!"},"","",{"$error":"#VALUE!"},{"$f":"SUM($H$20:$H282)","v":0}]
[{"$f":"IF(Values_Entered,A282+1,\"\")","v":""},"","","",{"$error":"#VALUE!"},{"$error":"#VALUE!"},"","",{"$error":"#VALUE!"},{"$f":"SUM($H$20:$H283)","v":0}]
[{"$f":"IF(Values_Entered,A283+1,\"\")","v":""},"","","",{"$error":"#VALUE!"},{"$error":"#VALUE!"},"","",{"$error":"#VALUE!"},{"$f":"SUM($H$20:$H284)","v":0}]
[{"$f":"IF(Values_Entered,A284+1,\"\")","v":""},"","","",{"$error":"#VALUE!"},{"$error":"#VALUE!"},"","",{"$error":"#VALUE!"},{"$f":"SUM($H$20:$H285)","v":0}]
[{"$f":"IF(Values_Entered,A285+1,\"\")","v":""},"","","",{"$error":"#VALUE!"},{"$error":"#VALUE!"},"","",{"$error":"#VALUE!"},{"$f":"SUM($H$20:$H286)","v":0}]
[{"$f":"IF(Values_Entered,A286+1,\"\")","v":""},"","","",{"$error":"#VALUE!"},{"$error":"#VALUE!"},"","",{"$error":"#VALUE!"},{"$f":"SUM($H$20:$H287)","v":0}]
[{"$f":"IF(Values_Entered,A287+1,\"\")","v":""},"","","",{"$error":"#VALUE!"},{"$error":"#VALUE!"},"","",{"$error":"#VALUE!"},{"$f":"SUM($H$20:$H288)","v":0}]
[{"$f":"IF(Values_Entered,A288+1,\"\")","v":""},"","","",{"$error":"#VALUE!"},{"$error":"#VALUE!"},"","",{"$error":"#VALUE!"},{"$f":"SUM($H$20:$H289)","v":0}]
[{"$f":"IF(Values_Entered,A289+1,\"\")","v":""},"","","",{"$error":"#VALUE!"},{"$error":"#VALUE!"},"","",{"$error":"#VALUE!"},{"$f":"SUM($H$20:$H290)","v":0}]
[{"$f":"IF(Values_Entered,A290+1,\"\")","v":""},"","","",{"$error":"#VALUE!"},{"$error":"#VALUE!"},"","",{"$error":"#VALUE!"},{"$f":"SUM($H$20:$H291)","v":0}]
[{"$f":"IF(Values_Entered,A291+1,\"\")","v":""},"","","",{"$error":"#VALUE!"},{"$error":"#VALUE!"},"","",{"$error":"#VALUE!"},{"$f":"SUM($H$20:$H292)","v":0}]
[{"$f":"IF(Values_Entered,A292+1,\"\")","v":""},"","","",{"$error":"#VALUE!"},{"$error":"#VALUE!"},"","",{"$error":"#VALUE!"},{"$f":"SUM($H$20:$H293)","v":0}]
[{"$f":"IF(Values_Entered,A293+1,\"\")","v":""},"","","",{"$error":"#VALUE!"},{"$error":"#VALUE!"},"","",{"$error":"#VALUE!"},{"$f":"SUM($H$20:$H294)","v":0}]
[{"$f":"IF(Values_Entered,A294+1,\"\")","v":""},"","","",{"$error":"#VALUE!"},{"$error":"#VALUE!"},"","",{"$error":"#VALUE!"},{"$f":"SUM($H$20:$H295)","v":0}]
[{"$f":"IF(Values_Entered,A295+1,\"\")","v":""},"","","",{"$error":"#VALUE!"},{"$error":"#VALUE!"},"","",{"$error":"#VALUE!"},{"$f":"SUM($H$20:$H296)","v":0}]
[{"$f":"IF(Values_Entered,A296+1,\"\")","v":""},"","","",{"$error":"#VALUE!"},{"$error":"#VALUE!"},"","",{"$error":"#VALUE!"},{"$f":"SUM($H$20:$H297)","v":0}]
[{"$f":"IF(Values_Entered,A297+1,\"\")","v":""},"","","",{"$error":"#VALUE!"},{"$error":"#VALUE!"},"","",{"$error":"#VALUE!"},{"$f":"SUM($H$20:$H298)","v":0}]
[{"$f":"IF(Values_Entered,A298+1,\"\")","v":""},"","","",{"$error":"#VALUE!"},{"$error":"#VALUE!"},"","",{"$error":"#VALUE!"},{"$f":"SUM($H$20:$H299)","v":0}]
[{"$f":"IF(Values_Entered,A299+1,\"\")","v":""},"","","",{"$error":"#VALUE!"},{"$error":"#VALUE!"},"","",{"$error":"#VALUE!"},{"$f":"SUM($H$20:$H300)","v":0}]
[{"$f":"IF(Values_Entered,A300+1,\"\")","v":""},"","","",{"$error":"#VALUE!"},{"$error":"#VALUE!"},"","",{"$error":"#VALUE!"},{"$f":"SUM($H$20:$H301)","v":0}]
[{"$f":"IF(Values_Entered,A301+1,\"\")","v":""},"","","",{"$error":"#VALUE!"},{"$error":"#VALUE!"},"","",{"$error":"#VALUE!"},{"$f":"SUM($H$20:$H302)","v":0}]
[{"$f":"IF(Values_Entered,A302+1,\"\")","v":""},"","","",{"$error":"#VALUE!"},{"$error":"#VALUE!"},"","",{"$error":"#VALUE!"},{"$f":"SUM($H$20:$H303)","v":0}]
[{"$f":"IF(Values_Entered,A303+1,\"\")","v":""},"","","",{"$error":"#VALUE!"},{"$error":"#VALUE!"},"","",{"$error":"#VALUE!"},{"$f":"SUM($H$20:$H304)","v":0}]
[{"$f":"IF(Values_Entered,A304+1,\"\")","v":""},"","","",{"$error":"#VALUE!"},{"$error":"#VALUE!"},"","",{"$error":"#VALUE!"},{"$f":"SUM($H$20:$H305)","v":0}]
[{"$f":"IF(Values_Entered,A305+1,\"\")","v":""},"","","",{"$error":"#VALUE!"},{"$error":"#VALUE!"},"","",{"$error":"#VALUE!"},{"$f":"SUM($H$20:$H306)","v":0}]
[{"$f":"IF(Values_Entered,A306+1,\"\")","v":""},"","","",{"$error":"#VALUE!"},{"$error":"#VALUE!"},"","",{"$error":"#VALUE!"},{"$f":"SUM($H$20:$H307)","v":0}]
[{"$f":"IF(Values_Entered,A307+1,\"\")","v":""},"","","",{"$error":"#VALUE!"},{"$error":"#VALUE!"},"","",{"$error":"#VALUE!"},{"$f":"SUM($H$20:$H308)","v":0}]
[{"$f":"IF(Values_Entered,A308+1,\"\")","v":""},"","","",{"$error":"#VALUE!"},{"$error":"#VALUE!"},"","",{"$error":"#VALUE!"},{"$f":"SUM($H$20:$H309)","v":0}]
[{"$f":"IF(Values_Entered,A309+1,\"\")","v":""},"","","",{"$error":"#VALUE!"},{"$error":"#VALUE!"},"","",{"$error":"#VALUE!"},{"$f":"SUM($H$20:$H310)","v":0}]
[{"$f":"IF(Values_Entered,A310+1,\"\")","v":""},"","","",{"$error":"#VALUE!"},{"$error":"#VALUE!"},"","",{"$error":"#VALUE!"},{"$f":"SUM($H$20:$H311)","v":0}]
[{"$f":"IF(Values_Entered,A311+1,\"\")","v":""},"","","",{"$error":"#VALUE!"},{"$error":"#VALUE!"},"","",{"$error":"#VALUE!"},{"$f":"SUM($H$20:$H312)","v":0}]
[{"$f":"IF(Values_Entered,A312+1,\"\")","v":""},"","","",{"$error":"#VALUE!"},{"$error":"#VALUE!"},"","",{"$error":"#VALUE!"},{"$f":"SUM($H$20:$H313)","v":0}]
[{"$f":"IF(Values_Entered,A313+1,\"\")","v":""},"","","",{"$error":"#VALUE!"},{"$error":"#VALUE!"},"","",{"$error":"#VALUE!"},{"$f":"SUM($H$20:$H314)","v":0}]
[{"$f":"IF(Values_Entered,A314+1,\"\")","v":""},"","","",{"$error":"#VALUE!"},{"$error":"#VALUE!"},"","",{"$error":"#VALUE!"},{"$f":"SUM($H$20:$H315)","v":0}]
[{"$f":"IF(Values_Entered,A315+1,\"\")","v":""},"","","",{"$error":"#VALUE!"},{"$error":"#VALUE!"},"","",{"$error":"#VALUE!"},{"$f":"SUM($H$20:$H316)","v":0}]
[{"$f":"IF(Values_Entered,A316+1,\"\")","v":""},"","","",{"$error":"#VALUE!"},{"$error":"#VALUE!"},"","",{"$error":"#VALUE!"},{"$f":"SUM($H$20:$H317)","v":0}]
[{"$f":"IF(Values_Entered,A317+1,\"\")","v":""},"","","",{"$error":"#VALUE!"},{"$error":"#VALUE!"},"","",{"$error":"#VALUE!"},{"$f":"SUM($H$20:$H318)","v":0}]
[{"$f":"IF(Values_Entered,A318+1,\"\")","v":""},"","","",{"$error":"#VALUE!"},{"$error":"#VALUE!"},"","",{"$error":"#VALUE!"},{"$f":"SUM($H$20:$H319)","v":0}]
[{"$f":"IF(Values_Entered,A319+1,\"\")","v":""},"","","",{"$error":"#VALUE!"},{"$error":"#VALUE!"},"","",{"$error":"#VALUE!"},{"$f":"SUM($H$20:$H320)","v":0}]
[{"$f":"IF(Values_Entered,A320+1,\"\")","v":""},"","","",{"$error":"#VALUE!"},{"$error":"#VALUE!"},"","",{"$error":"#VALUE!"},{"$f":"SUM($H$20:$H321)","v":0}]
[{"$f":"IF(Values_Entered,A321+1,\"\")","v":""},"","","",{"$error":"#VALUE!"},{"$error":"#VALUE!"},"","",{"$error":"#VALUE!"},{"$f":"SUM($H$20:$H322)","v":0}]
[{"$f":"IF(Values_Entered,A322+1,\"\")","v":""},"","","",{"$error":"#VALUE!"},{"$error":"#VALUE!"},"","",{"$error":"#VALUE!"},{"$f":"SUM($H$20:$H323)","v":0}]
[{"$f":"IF(Values_Entered,A323+1,\"\")","v":""},"","","",{"$error":"#VALUE!"},{"$error":"#VALUE!"},"","",{"$error":"#VALUE!"},{"$f":"SUM($H$20:$H324)","v":0}]
[{"$f":"IF(Values_Entered,A324+1,\"\")","v":""},"","","",{"$error":"#VALUE!"},{"$error":"#VALUE!"},"","",{"$error":"#VALUE!"},{"$f":"SUM($H$20:$H325)","v":0}]
[{"$f":"IF(Values_Entered,A325+1,\"\")","v":""},"","","",{"$error":"#VALUE!"},{"$error":"#VALUE!"},"","",{"$error":"#VALUE!"},{"$f":"SUM($H$20:$H326)","v":0}]
[{"$f":"IF(Values_Entered,A326+1,\"\")","v":""},"","","",{"$error":"#VALUE!"},{"$error":"#VALUE!"},"","",{"$error":"#VALUE!"},{"$f":"SUM($H$20:$H327)","v":0}]
[{"$f":"IF(Values_Entered,A327+1,\"\")","v":""},"","","",{"$error":"#VALUE!"},{"$error":"#VALUE!"},"","",{"$error":"#VALUE!"},{"$f":"SUM($H$20:$H328)","v":0}]
[{"$f":"IF(Values_Entered,A328+1,\"\")","v":""},"","","",{"$error":"#VALUE!"},{"$error":"#VALUE!"},"","",{"$error":"#VALUE!"},{"$f":"SUM($H$20:$H329)","v":0}]
[{"$f":"IF(Values_Entered,A329+1,\"\")","v":""},"","","",{"$error":"#VALUE!"},{"$error":"#VALUE!"},"","",{"$error":"#VALUE!"},{"$f":"SUM($H$20:$H330)","v":0}]
[{"$f":"IF(Values_Entered,A330+1,\"\")","v":""},"","","",{"$error":"#VALUE!"},{"$error":"#VALUE!"},"","",{"$error":"#VALUE!"},{"$f":"SUM($H$20:$H331)","v":0}]
[{"$f":"IF(Values_Entered,A331+1,\"\")","v":""},"","","",{"$error":"#VALUE!"},{"$error":"#VALUE!"},"","",{"$error":"#VALUE!"},{"$f":"SUM($H$20:$H332)","v":0}]
[{"$f":"IF(Values_Entered,A332+1,\"\")","v":""},"","","",{"$error":"#VALUE!"},{"$error":"#VALUE!"},"","",{"$error":"#VALUE!"},{"$f":"SUM($H$20:$H333)","v":0}]
[{"$f":"IF(Values_Entered,A333+1,\"\")","v":""},"","","",{"$error":"#VALUE!"},{"$error":"#VALUE!"},"","",{"$error":"#VALUE!"},{"$f":"SUM($H$20:$H334)","v":0}]
[{"$f":"IF(Values_Entered,A334+1,\"\")","v":""},"","","",{"$error":"#VALUE!"},{"$error":"#VALUE!"},"","",{"$error":"#VALUE!"},{"$f":"SUM($H$20:$H335)","v":0}]
[{"$f":"IF(Values_Entered,A335+1,\"\")","v":""},"","","",{"$error":"#VALUE!"},{"$error":"#VALUE!"},"","",{"$error":"#VALUE!"},{"$f":"SUM($H$20:$H336)","v":0}]
[{"$f":"IF(Values_Entered,A336+1,\"\")","v":""},"","","",{"$error":"#VALUE!"},{"$error":"#VALUE!"},"","",{"$error":"#VALUE!"},{"$f":"SUM($H$20:$H337)","v":0}]
[{"$f":"IF(Values_Entered,A337+1,\"\")","v":""},"","","",{"$error":"#VALUE!"},{"$error":"#VALUE!"},"","",{"$error":"#VALUE!"},{"$f":"SUM($H$20:$H338)","v":0}]
[{"$f":"IF(Values_Entered,A338+1,\"\")","v":""},"","","",{"$error":"#VALUE!"},{"$error":"#VALUE!"},"","",{"$error":"#VALUE!"},{"$f":"SUM($H$20:$H339)","v":0}]
[{"$f":"IF(Values_Entered,A339+1,\"\")","v":""},{"$f":"IF(Pay_Num<>\"\",DATE(YEAR(Loan_Start),MONTH(Loan_Start)+(Pay_Num)*12/Num_Pmt_Per_Year,DAY(Loan_Start)),\"\")","v":""},"","",{"$f":"IF(AND(Pay_Num<>\"\",Sched_Pay+Scheduled_Extra_Payments<Beg_Bal),Scheduled_Extra_Payments,IF(AND(Pay_Num<>\"\",Beg_Bal-Sched_Pay>0),Beg_Bal-Sched_Pay,IF(Pay_Num<>\"\",0,\"\")))","v":{"$error":"#VALUE!"}},{"$f":"IF(AND(Pay_Num<>\"\",Sched_Pay+Extra_Pay<Beg_Bal),Sched_Pay+Extra_Pay,IF(Pay_Num<>\"\",Beg_Bal,\"\"))","v":{"$error":"#VALUE!"}},"","",{"$f":"IF(AND(Pay_Num<>\"\",Sched_Pay+Extra_Pay<Beg_Bal),Beg_Bal-Princ,IF(Pay_Num<>\"\",0,\"\"))","v":{"$error":"#VALUE!"}},{"$f":"SUM($H$20:$H340)","v":0}]
[{"$f":"IF(Values_Entered,A340+1,\"\")","v":""},"",{"$f":"IF(Pay_Num<>\"\",I340,\"\")","v":""},"",{"$error":"#VALUE!"},{"$error":"#VALUE!"},{"$f":"IF(Pay_Num<>\"\",Total_Pay-Int,\"\")","v":""},{"$f":"IF(Pay_Num<>\"\",Beg_Bal*Interest_Rate/Num_Pmt_Per_Year,\"\")","v":""},{"$error":"#VALUE!"},{"$f":"SUM($H$20:$H341)","v":0}]
[{"$f":"IF(Values_Entered,A341+1,\"\")","v":""},"","",{"$f":"IF(Pay_Num<>\"\",Scheduled_Monthly_Payment,\"\")","v":""},{"$error":"#VALUE!"},{"$error":"#VALUE!"},"","",{"$error":"#VALUE!"},{"$f":"SUM($H$20:$H342)","v":0}]
[{"$f":"IF(Values_Entered,A342+1,\"\")","v":""},"","","",{"$error":"#VALUE!"},{"$error":"#VALUE!"},"","",{"$error":"#VALUE!"},{"$f":"SUM($H$20:$H343)","v":0}]
[{"$f":"IF(Values_Entered,A343+1,\"\")","v":""},"","","",{"$error":"#VALUE!"},{"$error":"#VALUE!"},"","",{"$error":"#VALUE!"},{"$f":"SUM($H$20:$H344)","v":0}]
[{"$f":"IF(Values_Entered,A344+1,\"\")","v":""},"","","",{"$error":"#VALUE!"},{"$error":"#VALUE!"},"","",{"$error":"#VALUE!"},{"$f":"SUM($H$20:$H345)","v":0}]
[{"$f":"IF(Values_Entered,A345+1,\"\")","v":""},"","","",{"$error":"#VALUE!"},{"$error":"#VALUE!"},"","",{"$error":"#VALUE!"},{"$f":"SUM($H$20:$H346)","v":0}]
[{"$f":"IF(Values_Entered,A346+1,\"\")","v":""},"","","",{"$error":"#VALUE!"},{"$error":"#VALUE!"},"","",{"$error":"#VALUE!"},{"$f":"SUM($H$20:$H347)","v":0}]
[{"$f":"IF(Values_Entered,A347+1,\"\")","v":""},"","","",{"$error":"#VALUE!"},{"$error":"#VALUE!"},"","",{"$error":"#VALUE!"},{"$f":"SUM($H$20:$H348)","v":0}]
[{"$f":"IF(Values_Entered,A348+1,\"\")","v":""},"","","",{"$error":"#VALUE!"},{"$error":"#VALUE!"},"","",{"$error":"#VALUE!"},{"$f":"SUM($H$20:$H349)","v":0}]
[{"$f":"IF(Values_Entered,A349+1,\"\")","v":""},"","","",{"$error":"#VALUE!"},{"$error":"#VALUE!"},"","",{"$error":"#VALUE!"},{"$f":"SUM($H$20:$H350)","v":0}]
[{"$f":"IF(Values_Entered,A350+1,\"\")","v":""},"","","",{"$error":"#VALUE!"},{"$error":"#VALUE!"},"","",{"$error":"#VALUE!"},{"$f":"SUM($H$20:$H351)","v":0}]
[{"$f":"IF(Values_Entered,A351+1,\"\")","v":""},"","","",{"$error":"#VALUE!"},{"$error":"#VALUE!"},"","",{"$error":"#VALUE!"},{"$f":"SUM($H$20:$H352)","v":0}]
[{"$f":"IF(Values_Entered,A352+1,\"\")","v":""},"","","",{"$error":"#VALUE!"},{"$error":"#VALUE!"},"","",{"$error":"#VALUE!"},{"$f":"SUM($H$20:$H353)","v":0}]
[{"$f":"IF(Values_Entered,A353+1,\"\")","v":""},"","","",{"$error":"#VALUE!"},{"$error":"#VALUE!"},"","",{"$error":"#VALUE!"},{"$f":"SUM($H$20:$H354)","v":0}]
[{"$f":"IF(Values_Entered,A354+1,\"\")","v":""},"","","",{"$error":"#VALUE!"},{"$error":"#VALUE!"},"","",{"$error":"#VALUE!"},{"$f":"SUM($H$20:$H355)","v":0}]
[{"$f":"IF(Values_Entered,A355+1,\"\")","v":""},"","","",{"$error":"#VALUE!"},{"$error":"#VALUE!"},"","",{"$error":"#VALUE!"},{"$f":"SUM($H$20:$H356)","v":0}]
[{"$f":"IF(Values_Entered,A356+1,\"\")","v":""},"","","",{"$error":"#VALUE!"},{"$error":"#VALUE!"},"","",{"$error":"#VALUE!"},{"$f":"SUM($H$20:$H357)","v":0}]
[{"$f":"IF(Values_Entered,A357+1,\"\")","v":""},"","","",{"$error":"#VALUE!"},{"$error":"#VALUE!"},"","",{"$error":"#VALUE!"},{"$f":"SUM($H$20:$H358)","v":0}]
[{"$f":"IF(Values_Entered,A358+1,\"\")","v":""},"","","",{"$error":"#VALUE!"},{"$error":"#VALUE!"},"","",{"$error":"#VALUE!"},{"$f":"SUM($H$20:$H359)","v":0}]
[{"$f":"IF(Values_Entered,A359+1,\"\")","v":""},"","","",{"$error":"#VALUE!"},{"$error":"#VALUE!"},"","",{"$error":"#VALUE!"},{"$f":"SUM($H$20:$H360)","v":0}]
[{"$f":"IF(Values_Entered,A360+1,\"\")","v":""},"","","",{"$error":"#VALUE!"},{"$error":"#VALUE!"},"","",{"$error":"#VALUE!"},{"$f":"SUM($H$20:$H361)","v":0}]
[{"$f":"IF(Values_Entered,A361+1,\"\")","v":""},"","","",{"$error":"#VALUE!"},{"$error":"#VALUE!"},"","",{"$error":"#VALUE!"},{"$f":"SUM($H$20:$H362)","v":0}]
[{"$f":"IF(Values_Entered,A362+1,\"\")","v":""},"","","",{"$error":"#VALUE!"},{"$error":"#VALUE!"},"","",{"$error":"#VALUE!"},{"$f":"SUM($H$20:$H363)","v":0}]
[{"$f":"IF(Values_Entered,A363+1,\"\")","v":""},"","","",{"$error":"#VALUE!"},{"$error":"#VALUE!"},"","",{"$error":"#VALUE!"},{"$f":"SUM($H$20:$H364)","v":0}]
[{"$f":"IF(Values_Entered,A364+1,\"\")","v":""},"","","",{"$error":"#VALUE!"},{"$error":"#VALUE!"},"","",{"$error":"#VALUE!"},{"$f":"SUM($H$20:$H365)","v":0}]
[{"$f":"IF(Values_Entered,A365+1,\"\")","v":""},"","","",{"$error":"#VALUE!"},{"$error":"#VALUE!"},"","",{"$error":"#VALUE!"},{"$f":"SUM($H$20:$H366)","v":0}]
[{"$f":"IF(Values_Entered,A366+1,\"\")","v":""},"","","",{"$error":"#VALUE!"},{"$error":"#VALUE!"},"","",{"$error":"#VALUE!"},{"$f":"SUM($H$20:$H367)","v":0}]
[{"$f":"IF(Values_Entered,A367+1,\"\")","v":""},"","","",{"$error":"#VALUE!"},{"$error":"#VALUE!"},"","",{"$error":"#VALUE!"},{"$f":"SUM($H$20:$H368)","v":0}]
[{"$f":"IF(Values_Entered,A368+1,\"\")","v":""},"","","",{"$error":"#VALUE!"},{"$error":"#VALUE!"},"","",{"$error":"#VALUE!"},{"$f":"SUM($H$20:$H369)","v":0}]
[{"$f":"IF(Values_Entered,A369+1,\"\")","v":""},"","","",{"$error":"#VALUE!"},{"$error":"#VALUE!"},"","",{"$error":"#VALUE!"},{"$f":"SUM($H$20:$H370)","v":0}]
[{"$f":"IF(Values_Entered,A370+1,\"\")","v":""},"","","",{"$error":"#VALUE!"},{"$error":"#VALUE!"},"","",{"$error":"#VALUE!"},{"$f":"SUM($H$20:$H371)","v":0}]
[{"$f":"IF(Values_Entered,A371+1,\"\")","v":""},"","","",{"$error":"#VALUE!"},{"$error":"#VALUE!"},"","",{"$error":"#VALUE!"},{"$f":"SUM($H$20:$H372)","v":0}]
[{"$f":"IF(Values_Entered,A372+1,\"\")","v":""},"","","",{"$error":"#VALUE!"},{"$error":"#VALUE!"},"","",{"$error":"#VALUE!"},{"$f":"SUM($H$20:$H373)","v":0}]
[{"$f":"IF(Values_Entered,A373+1,\"\")","v":""},"","","",{"$error":"#VALUE!"},{"$error":"#VALUE!"},"","",{"$error":"#VALUE!"},{"$f":"SUM($H$20:$H374)","v":0}]
[{"$f":"IF(Values_Entered,A374+1,\"\")","v":""},"","","",{"$error":"#VALUE!"},{"$error":"#VALUE!"},"","",{"$error":"#VALUE!"},{"$f":"SUM($H$20:$H375)","v":0}]
[{"$f":"IF(Values_Entered,A375+1,\"\")","v":""},"","","",{"$error":"#VALUE!"},{"$error":"#VALUE!"},"","",{"$error":"#VALUE!"},{"$f":"SUM($H$20:$H376)","v":0}]
[{"$f":"IF(Values_Entered,A376+1,\"\")","v":""},"","","",{"$error":"#VALUE!"},{"$error":"#VALUE!"},"","",{"$error":"#VALUE!"},{"$f":"SUM($H$20:$H377)","v":0}]
[{"$f":"IF(Values_Entered,A377+1,\"\")","v":""},"","","",{"$error":"#VALUE!"},{"$error":"#VALUE!"},"","",{"$error":"#VALUE!"},{"$f":"SUM($H$20:$H378)","v":0}]
[{"$f":"IF(Values_Entered,A378+1,\"\")","v":""},"","","",{"$error":"#VALUE!"},{"$error":"#VALUE!"},"","",{"$error":"#VALUE!"},{"$f":"SUM($H$20:$H379)","v":0}]

{"sheet":"Loan Repayment Diesel","index":6,"n_rows":379,"n_cols":10,"rows_kept":379,"cut":false,"hidden":true,"merged":[[0,0,0,4],[0,5,0,9],[8,1,8,3],[8,5,8,7]]}
["Loan Repayment:",{"$nulls":4},{"$f":"Input!D57","v":"Grid powered irrigation system costs"}]
["Bank:",{"$f":"Input!E116","v":0}]
[]
[]
[]
[]
[]
[]
[null,"Enter Values",null,null,null,"Loan Summary"]
[null,null,"Loan Amount",{"$f":"Input!E113","v":0},null,null,"Scheduled Payment",{"$f":"IF(Values_Entered,-PMT(Interest_Rate/Num_Pmt_Per_Year,Loan_Years*Num_Pmt_Per_Year,Loan_Amount),\"0\")","v":"0"}]
[null,null,"Annual Interest Rate",{"$f":"Input!E114","v":0},null,null,"Scheduled Number of Payments",{"$f":"IF(Values_Entered,Loan_Years*Num_Pmt_Per_Year,\"\")","v":""}]
[null,null,"Loan Period in Years",{"$f":"Input!E115","v":0},null,null,"Actual Number of Payments",{"$f":"IF(Values_Entered,Number_of_Payments,\"\")","v":""}]
[null,null,"Number of Payments Per Year",1,null,null,"Total Early Payments",{"$f":"IF(Values_Entered,SUMIF(Beg_Bal,\">0\",Extra_Pay),\"\")","v":""}]
[null,null,"Start Date of Loan","2017-01-01",null,null,"Total Interest",{"$f":"IF(Values_Entered,SUMIF(Beg_Bal,\">0\",Int),\"\")","v":""}]
[null,null,"Optional Extra Payments",0]
[]
[]
["PmtNo.","Payment Date","Beginning Balance","Scheduled Payment","Extra Payment","Total Payment","Principal","Interest","Ending Balance","Cumulative Interest"]
[]
[{"$f":"IF(Values_Entered,1,\"\")","v":""},{"$f":"IF(Pay_Num<>\"\",DATE(YEAR(Loan_Start),MONTH(Loan_Start)+(Pay_Num)*12/Num_Pmt_Per_Year,DAY(Loan_Start)),\"\")","v":""},{"$f":"IF(Values_Entered,Loan_Amount,\"\")","v":""},{"$f":"IF(Pay_Num<>\"\",Scheduled_Monthly_Payment,\"\")","v":""},{"$f":"IF(AND(Pay_Num<>\"\",Sched_Pay+Scheduled_Extra_Payments<Beg_Bal),Scheduled_Extra_Payments,IF(AND(Pay_Num<>\"\",Beg_Bal-Sched_Pay>0),Beg_Bal-Sched_Pay,IF(Pay_Num<>\"\",0,\"\")))","v":{"$error":"#VALUE!"}},{"$f":"IF(AND(Pay_Num<>\"\",Sched_Pay+Extra_Pay<Beg_Bal),Sched_Pay+Extra_Pay,IF(Pay_Num<>\"\",Beg_Bal,\"\"))","v":{"$error":"#VALUE!"}},{"$f":"IF(Pay_Num<>\"\",Total_Pay-Int,\"\")","v":""},{"$f":"IF(Pay_Num<>\"\",Beg_Bal*(Interest_Rate/Num_Pmt_Per_Year),\"\")","v":""},{"$f":"IF(AND(Pay_Num<>\"\",Sched_Pay+Extra_Pay<Beg_Bal),Beg_Bal-Princ,IF(Pay_Num<>\"\",0,\"\"))","v":{"$error":"#VALUE!"}},{"$f":"SUM($H$20:$H20)","v":0}]
[{"$f":"IF(Values_Entered,A20+1,\"\")","v":""},"",{"$f":"IF(Pay_Num<>\"\",I20,\"\")","v":""},{"$f":"IF(Pay_Num<>\"\",Scheduled_Monthly_Payment,\"\")","v":""},{"$error":"#VALUE!"},{"$error":"#VALUE!"},{"$f":"IF(Pay_Num<>\"\",Total_Pay-Int,\"\")","v":""},{"$f":"IF(Pay_Num<>\"\",Beg_Bal*Interest_Rate/Num_Pmt_Per_Year,\"\")","v":""},{"$error":"#VALUE!"},{"$f":"SUM($H$20:$H21)","v":0}]
[{"$f":"IF(Values_Entered,A21+1,\"\")","v":""},"","",{"$f":"IF(Pay_Num<>\"\",Scheduled_Monthly_Payment,\"\")","v":""},{"$error":"#VALUE!"},{"$error":"#VALUE!"},"","",{"$error":"#VALUE!"},{"$f":"SUM($H$20:$H22)","v":0}]
[{"$f":"IF(Values_Entered,A22+1,\"\")","v":""},"","",{"$f":"IF(Pay_Num<>\"\",Scheduled_Monthly_Payment,\"\")","v":""},{"$error":"#VALUE!"},{"$error":"#VALUE!"},"","",{"$error":"#VALUE!"},{"$f":"SUM($H$20:$H23)","v":0}]
[{"$f":"IF(Values_Entered,A23+1,\"\")","v":""},"","","",{"$error":"#VALUE!"},{"$error":"#VALUE!"},"","",{"$error":"#VALUE!"},{"$f":"SUM($H$20:$H24)","v":0}]
[{"$f":"IF(Values_Entered,A24+1,\"\")","v":""},"","","",{"$error":"#VALUE!"},{"$error":"#VALUE!"},"","",{"$error":"#VALUE!"},{"$f":"SUM($H$20:$H25)","v":0}]
[{"$f":"IF(Values_Entered,A25+1,\"\")","v":""},"","","",{"$error":"#VALUE!"},{"$error":"#VALUE!"},"","",{"$error":"#VALUE!"},{"$f":"SUM($H$20:$H26)","v":0}]
[{"$f":"IF(Values_Entered,A26+1,\"\")","v":""},"","","",{"$error":"#VALUE!"},{"$error":"#VALUE!"},"","",{"$error":"#VALUE!"},{"$f":"SUM($H$20:$H27)","v":0}]
[{"$f":"IF(Values_Entered,A27+1,\"\")","v":""},"","","",{"$error":"#VALUE!"},{"$error":"#VALUE!"},"","",{"$error":"#VALUE!"},{"$f":"SUM($H$20:$H28)","v":0}]
[{"$f":"IF(Values_Entered,A28+1,\"\")","v":""},"","","",{"$error":"#VALUE!"},{"$error":"#VALUE!"},"","",{"$error":"#VALUE!"},{"$f":"SUM($H$20:$H29)","v":0}]
[{"$f":"IF(Values_Entered,A29+1,\"\")","v":""},"","","",{"$error":"#VALUE!"},{"$error":"#VALUE!"},"","",{"$error":"#VALUE!"},{"$f":"SUM($H$20:$H30)","v":0}]
[{"$f":"IF(Values_Entered,A30+1,\"\")","v":""},"","","",{"$error":"#VALUE!"},{"$error":"#VALUE!"},"","",{"$error":"#VALUE!"},{"$f":"SUM($H$20:$H31)","v":0}]
[{"$f":"IF(Values_Entered,A31+1,\"\")","v":""},"","","",{"$error":"#VALUE!"},{"$error":"#VALUE!"},"","",{"$error":"#VALUE!"},{"$f":"SUM($H$20:$H32)","v":0}]
[{"$f":"IF(Values_Entered,A32+1,\"\")","v":""},"","","",{"$error":"#VALUE!"},{"$error":"#VALUE!"},"","",{"$error":"#VALUE!"},{"$f":"SUM($H$20:$H33)","v":0}]
[{"$f":"IF(Values_Entered,A33+1,\"\")","v":""},"","","",{"$error":"#VALUE!"},{"$error":"#VALUE!"},"","",{"$error":"#VALUE!"},{"$f":"SUM($H$20:$H34)","v":0}]
[{"$f":"IF(Values_Entered,A34+1,\"\")","v":""},"","","",{"$error":"#VALUE!"},{"$error":"#VALUE!"},"","",{"$error":"#VALUE!"},{"$f":"SUM($H$20:$H35)","v":0}]
[{"$f":"IF(Values_Entered,A35+1,\"\")","v":""},"","","",{"$error":"#VALUE!"},{"$error":"#VALUE!"},"","",{"$error":"#VALUE!"},{"$f":"SUM($H$20:$H36)","v":0}]
[{"$f":"IF(Values_Entered,A36+1,\"\")","v":""},"","","",{"$error":"#VALUE!"},{"$error":"#VALUE!"},"","",{"$error":"#VALUE!"},{"$f":"SUM($H$20:$H37)","v":0}]
[{"$f":"IF(Values_Entered,A37+1,\"\")","v":""},"","","",{"$error":"#VALUE!"},{"$error":"#VALUE!"},"","",{"$error":"#VALUE!"},{"$f":"SUM($H$20:$H38)","v":0}]
[{"$f":"IF(Values_Entered,A38+1,\"\")","v":""},"","","",{"$error":"#VALUE!"},{"$error":"#VALUE!"},"","",{"$error":"#VALUE!"},{"$f":"SUM($H$20:$H39)","v":0}]
[{"$f":"IF(Values_Entered,A39+1,\"\")","v":""},"","","",{"$error":"#VALUE!"},{"$error":"#VALUE!"},"","",{"$error":"#VALUE!"},{"$f":"SUM($H$20:$H40)","v":0}]
[{"$f":"IF(Values_Entered,A40+1,\"\")","v":""},"","","",{"$error":"#VALUE!"},{"$error":"#VALUE!"},"","",{"$error":"#VALUE!"},{"$f":"SUM($H$20:$H41)","v":0}]
[{"$f":"IF(Values_Entered,A41+1,\"\")","v":""},"","","",{"$error":"#VALUE!"},{"$error":"#VALUE!"},"","",{"$error":"#VALUE!"},{"$f":"SUM($H$20:$H42)","v":0}]
[{"$f":"IF(Values_Entered,A42+1,\"\")","v":""},"","","",{"$error":"#VALUE!"},{"$error":"#VALUE!"},"","",{"$error":"#VALUE!"},{"$f":"SUM($H$20:$H43)","v":0}]
[{"$f":"IF(Values_Entered,A43+1,\"\")","v":""},"","","",{"$error":"#VALUE!"},{"$error":"#VALUE!"},"","",{"$error":"#VALUE!"},{"$f":"SUM($H$20:$H44)","v":0}]
[{"$f":"IF(Values_Entered,A44+1,\"\")","v":""},"","","",{"$error":"#VALUE!"},{"$error":"#VALUE!"},"","",{"$error":"#VALUE!"},{"$f":"SUM($H$20:$H45)","v":0}]
[{"$f":"IF(Values_Entered,A45+1,\"\")","v":""},"","","",{"$error":"#VALUE!"},{"$error":"#VALUE!"},"","",{"$error":"#VALUE!"},{"$f":"SUM($H$20:$H46)","v":0}]
[{"$f":"IF(Values_Entered,A46+1,\"\")","v":""},"","","",{"$error":"#VALUE!"},{"$error":"#VALUE!"},"","",{"$error":"#VALUE!"},{"$f":"SUM($H$20:$H47)","v":0}]
[{"$f":"IF(Values_Entered,A47+1,\"\")","v":""},"","","",{"$error":"#VALUE!"},{"$error":"#VALUE!"},"","",{"$error":"#VALUE!"},{"$f":"SUM($H$20:$H48)","v":0}]
[{"$f":"IF(Values_Entered,A48+1,\"\")","v":""},"","","",{"$error":"#VALUE!"},{"$error":"#VALUE!"},"","",{"$error":"#VALUE!"},{"$f":"SUM($H$20:$H49)","v":0}]
[{"$f":"IF(Values_Entered,A49+1,\"\")","v":""},"","","",{"$error":"#VALUE!"},{"$error":"#VALUE!"},"","",{"$error":"#VALUE!"},{"$f":"SUM($H$20:$H50)","v":0}]
[{"$f":"IF(Values_Entered,A50+1,\"\")","v":""},"","","",{"$error":"#VALUE!"},{"$error":"#VALUE!"},"","",{"$error":"#VALUE!"},{"$f":"SUM($H$20:$H51)","v":0}]
[{"$f":"IF(Values_Entered,A51+1,\"\")","v":""},"","","",{"$error":"#VALUE!"},{"$error":"#VALUE!"},"","",{"$error":"#VALUE!"},{"$f":"SUM($H$20:$H52)","v":0}]
[{"$f":"IF(Values_Entered,A52+1,\"\")","v":""},"","","",{"$error":"#VALUE!"},{"$error":"#VALUE!"},"","",{"$error":"#VALUE!"},{"$f":"SUM($H$20:$H53)","v":0}]
[{"$f":"IF(Values_Entered,A53+1,\"\")","v":""},"","","",{"$error":"#VALUE!"},{"$error":"#VALUE!"},"","",{"$error":"#VALUE!"},{"$f":"SUM($H$20:$H54)","v":0}]
[{"$f":"IF(Values_Entered,A54+1,\"\")","v":""},"","","",{"$error":"#VALUE!"},{"$error":"#VALUE!"},"","",{"$error":"#VALUE!"},{"$f":"SUM($H$20:$H55)","v":0}]
[{"$f":"IF(Values_Entered,A55+1,\"\")","v":""},"","","",{"$error":"#VALUE!"},{"$error":"#VALUE!"},"","",{"$error":"#VALUE!"},{"$f":"SUM($H$20:$H56)","v":0}]
[{"$f":"IF(Values_Entered,A56+1,\"\")","v":""},"","","",{"$error":"#VALUE!"},{"$error":"#VALUE!"},"","",{"$error":"#VALUE!"},{"$f":"SUM($H$20:$H57)","v":0}]
[{"$f":"IF(Values_Entered,A57+1,\"\")","v":""},"","","",{"$error":"#VALUE!"},{"$error":"#VALUE!"},"","",{"$error":"#VALUE!"},{"$f":"SUM($H$20:$H58)","v":0}]
[{"$f":"IF(Values_Entered,A58+1,\"\")","v":""},"","","",{"$error":"#VALUE!"},{"$error":"#VALUE!"},"","",{"$error":"#VALUE!"},{"$f":"SUM($H$20:$H59)","v":0}]
[{"$f":"IF(Values_Entered,A59+1,\"\")","v":""},"","","",{"$error":"#VALUE!"},{"$error":"#VALUE!"},"","",{"$error":"#VALUE!"},{"$f":"SUM($H$20:$H60)","v":0}]
[{"$f":"IF(Values_Entered,A60+1,\"\")","v":""},"","","",{"$error":"#VALUE!"},{"$error":"#VALUE!"},"","",{"$error":"#VALUE!"},{"$f":"SUM($H$20:$H61)","v":0}]
[{"$f":"IF(Values_Entered,A61+1,\"\")","v":""},"","","",{"$error":"#VALUE!"},{"$error":"#VALUE!"},"","",{"$error":"#VALUE!"},{"$f":"SUM($H$20:$H62)","v":0}]
[{"$f":"IF(Values_Entered,A62+1,\"\")","v":""},"","","",{"$error":"#VALUE!"},{"$error":"#VALUE!"},"","",{"$error":"#VALUE!"},{"$f":"SUM($H$20:$H63)","v":0}]
[{"$f":"IF(Values_Entered,A63+1,\"\")","v":""},"","","",{"$error":"#VALUE!"},{"$error":"#VALUE!"},"","",{"$error":"#VALUE!"},{"$f":"SUM($H$20:$H64)","v":0}]
[{"$f":"IF(Values_Entered,A64+1,\"\")","v":""},"","","",{"$error":"#VALUE!"},{"$error":"#VALUE!"},"","",{"$error":"#VALUE!"},{"$f":"SUM($H$20:$H65)","v":0}]
[{"$f":"IF(Values_Entered,A65+1,\"\")","v":""},"","","",{"$error":"#VALUE!"},{"$error":"#VALUE!"},"","",{"$error":"#VALUE!"},{"$f":"SUM($H$20:$H66)","v":0}]
[{"$f":"IF(Values_Entered,A66+1,\"\")","v":""},"","","",{"$error":"#VALUE!"},{"$error":"#VALUE!"},"","",{"$error":"#VALUE!"},{"$f":"SUM($H$20:$H67)","v":0}]
[{"$f":"IF(Values_Entered,A67+1,\"\")","v":""},"","","",{"$error":"#VALUE!"},{"$error":"#VALUE!"},"","",{"$error":"#VALUE!"},{"$f":"SUM($H$20:$H68)","v":0}]
[{"$f":"IF(Values_Entered,A68+1,\"\")","v":""},"","","",{"$error":"#VALUE!"},{"$error":"#VALUE!"},"","",{"$error":"#VALUE!"},{"$f":"SUM($H$20:$H69)","v":0}]
[{"$f":"IF(Values_Entered,A69+1,\"\")","v":""},"","","",{"$error":"#VALUE!"},{"$error":"#VALUE!"},"","",{"$error":"#VALUE!"},{"$f":"SUM($H$20:$H70)","v":0}]
[{"$f":"IF(Values_Entered,A70+1,\"\")","v":""},"","","",{"$error":"#VALUE!"},{"$error":"#VALUE!"},"","",{"$error":"#VALUE!"},{"$f":"SUM($H$20:$H71)","v":0}]
[{"$f":"IF(Values_Entered,A71+1,\"\")","v":""},"","","",{"$error":"#VALUE!"},{"$error":"#VALUE!"},"","",{"$error":"#VALUE!"},{"$f":"SUM($H$20:$H72)","v":0}]
[{"$f":"IF(Values_Entered,A72+1,\"\")","v":""},"","","",{"$error":"#VALUE!"},{"$error":"#VALUE!"},"","",{"$error":"#VALUE!"},{"$f":"SUM($H$20:$H73)","v":0}]
[{"$f":"IF(Values_Entered,A73+1,\"\")","v":""},"","","",{"$error":"#VALUE!"},{"$error":"#VALUE!"},"","",{"$error":"#VALUE!"},{"$f":"SUM($H$20:$H74)","v":0}]
[{"$f":"IF(Values_Entered,A74+1,\"\")","v":""},"","","",{"$error":"#VALUE!"},{"$error":"#VALUE!"},"","",{"$error":"#VALUE!"},{"$f":"SUM($H$20:$H75)","v":0}]
[{"$f":"IF(Values_Entered,A75+1,\"\")","v":""},"","","",{"$error":"#VALUE!"},{"$error":"#VALUE!"},"","",{"$error":"#VALUE!"},{"$f":"SUM($H$20:$H76)","v":0}]
[{"$f":"IF(Values_Entered,A76+1,\"\")","v":""},"","","",{"$error":"#VALUE!"},{"$error":"#VALUE!"},"","",{"$error":"#VALUE!"},{"$f":"SUM($H$20:$H77)","v":0}]
[{"$f":"IF(Values_Entered,A77+1,\"\")","v":""},"","","",{"$error":"#VALUE!"},{"$error":"#VALUE!"},"","",{"$error":"#VALUE!"},{"$f":"SUM($H$20:$H78)","v":0}]
[{"$f":"IF(Values_Entered,A78+1,\"\")","v":""},"","","",{"$error":"#VALUE!"},{"$error":"#VALUE!"},"","",{"$error":"#VALUE!"},{"$f":"SUM($H$20:$H79)","v":0}]
[{"$f":"IF(Values_Entered,A79+1,\"\")","v":""},"","","",{"$error":"#VALUE!"},{"$error":"#VALUE!"},"","",{"$error":"#VALUE!"},{"$f":"SUM($H$20:$H80)","v":0}]
[{"$f":"IF(Values_Entered,A80+1,\"\")","v":""},"","","",{"$error":"#VALUE!"},{"$error":"#VALUE!"},"","",{"$error":"#VALUE!"},{"$f":"SUM($H$20:$H81)","v":0}]
[{"$f":"IF(Values_Entered,A81+1,\"\")","v":""},"","","",{"$error":"#VALUE!"},{"$error":"#VALUE!"},"","",{"$error":"#VALUE!"},{"$f":"SUM($H$20:$H82)","v":0}]
[{"$f":"IF(Values_Entered,A82+1,\"\")","v":""},"","","",{"$error":"#VALUE!"},{"$error":"#VALUE!"},"","",{"$error":"#VALUE!"},{"$f":"SUM($H$20:$H83)","v":0}]
[{"$f":"IF(Values_Entered,A83+1,\"\")","v":""},{"$f":"IF(Pay_Num<>\"\",DATE(YEAR(Loan_Start),MONTH(Loan_Start)+(Pay_Num)*12/Num_Pmt_Per_Year,DAY(Loan_Start)),\"\")","v":""},"","",{"$f":"IF(AND(Pay_Num<>\"\",Sched_Pay+Scheduled_Extra_Payments<Beg_Bal),Scheduled_Extra_Payments,IF(AND(Pay_Num<>\"\",Beg_Bal-Sched_Pay>0),Beg_Bal-Sched_Pay,IF(Pay_Num<>\"\",0,\"\")))","v":{"$error":"#VALUE!"}},{"$f":"IF(AND(Pay_Num<>\"\",Sched_Pay+Extra_Pay<Beg_Bal),Sched_Pay+Extra_Pay,IF(Pay_Num<>\"\",Beg_Bal,\"\"))","v":{"$error":"#VALUE!"}},"","",{"$f":"IF(AND(Pay_Num<>\"\",Sched_Pay+Extra_Pay<Beg_Bal),Beg_Bal-Princ,IF(Pay_Num<>\"\",0,\"\"))","v":{"$error":"#VALUE!"}},{"$f":"SUM($H$20:$H84)","v":0}]
[{"$f":"IF(Values_Entered,A84+1,\"\")","v":""},"",{"$f":"IF(Pay_Num<>\"\",I84,\"\")","v":""},"",{"$error":"#VALUE!"},{"$error":"#VALUE!"},{"$f":"IF(Pay_Num<>\"\",Total_Pay-Int,\"\")","v":""},{"$f":"IF(Pay_Num<>\"\",Beg_Bal*Interest_Rate/Num_Pmt_Per_Year,\"\")","v":""},{"$error":"#VALUE!"},{"$f":"SUM($H$20:$H85)","v":0}]
[{"$f":"IF(Values_Entered,A85+1,\"\")","v":""},"","",{"$f":"IF(Pay_Num<>\"\",Scheduled_Monthly_Payment,\"\")","v":""},{"$error":"#VALUE!"},{"$error":"#VALUE!"},"","",{"$error":"#VALUE!"},{"$f":"SUM($H$20:$H86)","v":0}]
[{"$f":"IF(Values_Entered,A86+1,\"\")","v":""},"","","",{"$error":"#VALUE!"},{"$error":"#VALUE!"},"","",{"$error":"#VALUE!"},{"$f":"SUM($H$20:$H87)","v":0}]
[{"$f":"IF(Values_Entered,A87+1,\"\")","v":""},"","","",{"$error":"#VALUE!"},{"$error":"#VALUE!"},"","",{"$error":"#VALUE!"},{"$f":"SUM($H$20:$H88)","v":0}]
[{"$f":"IF(Values_Entered,A88+1,\"\")","v":""},"","","",{"$error":"#VALUE!"},{"$error":"#VALUE!"},"","",{"$error":"#VALUE!"},{"$f":"SUM($H$20:$H89)","v":0}]
[{"$f":"IF(Values_Entered,A89+1,\"\")","v":""},"","","",{"$error":"#VALUE!"},{"$error":"#VALUE!"},"","",{"$error":"#VALUE!"},{"$f":"SUM($H$20:$H90)","v":0}]
[{"$f":"IF(Values_Entered,A90+1,\"\")","v":""},"","","",{"$error":"#VALUE!"},{"$error":"#VALUE!"},"","",{"$error":"#VALUE!"},{"$f":"SUM($H$20:$H91)","v":0}]
[{"$f":"IF(Values_Entered,A91+1,\"\")","v":""},"","","",{"$error":"#VALUE!"},{"$error":"#VALUE!"},"","",{"$error":"#VALUE!"},{"$f":"SUM($H$20:$H92)","v":0}]
[{"$f":"IF(Values_Entered,A92+1,\"\")","v":""},"","","",{"$error":"#VALUE!"},{"$error":"#VALUE!"},"","",{"$error":"#VALUE!"},{"$f":"SUM($H$20:$H93)","v":0}]
[{"$f":"IF(Values_Entered,A93+1,\"\")","v":""},"","","",{"$error":"#VALUE!"},{"$error":"#VALUE!"},"","",{"$error":"#VALUE!"},{"$f":"SUM($H$20:$H94)","v":0}]
[{"$f":"IF(Values_Entered,A94+1,\"\")","v":""},"","","",{"$error":"#VALUE!"},{"$error":"#VALUE!"},"","",{"$error":"#VALUE!"},{"$f":"SUM($H$20:$H95)","v":0}]
[{"$f":"IF(Values_Entered,A95+1,\"\")","v":""},"","","",{"$error":"#VALUE!"},{"$error":"#VALUE!"},"","",{"$error":"#VALUE!"},{"$f":"SUM($H$20:$H96)","v":0}]
[{"$f":"IF(Values_Entered,A96+1,\"\")","v":""},"","","",{"$error":"#VALUE!"},{"$error":"#VALUE!"},"","",{"$error":"#VALUE!"},{"$f":"SUM($H$20:$H97)","v":0}]
[{"$f":"IF(Values_Entered,A97+1,\"\")","v":""},"","","",{"$error":"#VALUE!"},{"$error":"#VALUE!"},"","",{"$error":"#VALUE!"},{"$f":"SUM($H$20:$H98)","v":0}]
[{"$f":"IF(Values_Entered,A98+1,\"\")","v":""},"","","",{"$error":"#VALUE!"},{"$error":"#VALUE!"},"","",{"$error":"#VALUE!"},{"$f":"SUM($H$20:$H99)","v":0}]
[{"$f":"IF(Values_Entered,A99+1,\"\")","v":""},"","","",{"$error":"#VALUE!"},{"$error":"#VALUE!"},"","",{"$error":"#VALUE!"},{"$f":"SUM($H$20:$H100)","v":0}]
[{"$f":"IF(Values_Entered,A100+1,\"\")","v":""},"","","",{"$error":"#VALUE!"},{"$error":"#VALUE!"},"","",{"$error":"#VALUE!"},{"$f":"SUM($H$20:$H101)","v":0}]
[{"$f":"IF(Values_Entered,A101+1,\"\")","v":""},"","","",{"$error":"#VALUE!"},{"$error":"#VALUE!"},"","",{"$error":"#VALUE!"},{"$f":"SUM($H$20:$H102)","v":0}]
[{"$f":"IF(Values_Entered,A102+1,\"\")","v":""},"","","",{"$error":"#VALUE!"},{"$error":"#VALUE!"},"","",{"$error":"#VALUE!"},{"$f":"SUM($H$20:$H103)","v":0}]
[{"$f":"IF(Values_Entered,A103+1,\"\")","v":""},"","","",{"$error":"#VALUE!"},{"$error":"#VALUE!"},"","",{"$error":"#VALUE!"},{"$f":"SUM($H$20:$H104)","v":0}]
[{"$f":"IF(Values_Entered,A104+1,\"\")","v":""},"","","",{"$error":"#VALUE!"},{"$error":"#VALUE!"},"","",{"$error":"#VALUE!"},{"$f":"SUM($H$20:$H105)","v":0}]
[{"$f":"IF(Values_Entered,A105+1,\"\")","v":""},"","","",{"$error":"#VALUE!"},{"$error":"#VALUE!"},"","",{"$error":"#VALUE!"},{"$f":"SUM($H$20:$H106)","v":0}]
[{"$f":"IF(Values_Entered,A106+1,\"\")","v":""},"","","",{"$error":"#VALUE!"},{"$error":"#VALUE!"},"","",{"$error":"#VALUE!"},{"$f":"SUM($H$20:$H107)","v":0}]
[{"$f":"IF(Values_Entered,A107+1,\"\")","v":""},"","","",{"$error":"#VALUE!"},{"$error":"#VALUE!"},"","",{"$error":"#VALUE!"},{"$f":"SUM($H$20:$H108)","v":0}]
[{"$f":"IF(Values_Entered,A108+1,\"\")","v":""},"","","",{"$error":"#VALUE!"},{"$error":"#VALUE!"},"","",{"$error":"#VALUE!"},{"$f":"SUM($H$20:$H109)","v":0}]
[{"$f":"IF(Values_Entered,A109+1,\"\")","v":""},"","","",{"$error":"#VALUE!"},{"$error":"#VALUE!"},"","",{"$error":"#VALUE!"},{"$f":"SUM($H$20:$H110)","v":0}]
[{"$f":"IF(Values_Entered,A110+1,\"\")","v":""},"","","",{"$error":"#VALUE!"},{"$error":"#VALUE!"},"","",{"$error":"#VALUE!"},{"$f":"SUM($H$20:$H111)","v":0}]
[{"$f":"IF(Values_Entered,A111+1,\"\")","v":""},"","","",{"$error":"#VALUE!"},{"$error":"#VALUE!"},"","",{"$error":"#VALUE!"},{"$f":"SUM($H$20:$H112)","v":0}]
[{"$f":"IF(Values_Entered,A112+1,\"\")","v":""},"","","",{"$error":"#VALUE!"},{"$error":"#VALUE!"},"","",{"$error":"#VALUE!"},{"$f":"SUM($H$20:$H113)","v":0}]
[{"$f":"IF(Values_Entered,A113+1,\"\")","v":""},"","","",{"$error":"#VALUE!"},{"$error":"#VALUE!"},"","",{"$error":"#VALUE!"},{"$f":"SUM($H$20:$H114)","v":0}]
[{"$f":"IF(Values_Entered,A114+1,\"\")","v":""},"","","",{"$error":"#VALUE!"},{"$error":"#VALUE!"},"","",{"$error":"#VALUE!"},{"$f":"SUM($H$20:$H115)","v":0}]
[{"$f":"IF(Values_Entered,A115+1,\"\")","v":""},"","","",{"$error":"#VALUE!"},{"$error":"#VALUE!"},"","",{"$error":"#VALUE!"},{"$f":"SUM($H$20:$H116)","v":0}]
[{"$f":"IF(Values_Entered,A116+1,\"\")","v":""},"","","",{"$error":"#VALUE!"},{"$error":"#VALUE!"},"","",{"$error":"#VALUE!"},{"$f":"SUM($H$20:$H117)","v":0}]
[{"$f":"IF(Values_Entered,A117+1,\"\")","v":""},"","","",{"$error":"#VALUE!"},{"$error":"#VALUE!"},"","",{"$error":"#VALUE!"},{"$f":"SUM($H$20:$H118)","v":0}]
[{"$f":"IF(Values_Entered,A118+1,\"\")","v":""},"","","",{"$error":"#VALUE!"},{"$error":"#VALUE!"},"","",{"$error":"#VALUE!"},{"$f":"SUM($H$20:$H119)","v":0}]
[{"$f":"IF(Values_Entered,A119+1,\"\")","v":""},"","","",{"$error":"#VALUE!"},{"$error":"#VALUE!"},"","",{"$error":"#VALUE!"},{"$f":"SUM($H$20:$H120)","v":0}]
[{"$f":"IF(Values_Entered,A120+1,\"\")","v":""},"","","",{"$error":"#VALUE!"},{"$error":"#VALUE!"},"","",{"$error":"#VALUE!"},{"$f":"SUM($H$20:$H121)","v":0}]
[{"$f":"IF(Values_Entered,A121+1,\"\")","v":""},"","","",{"$error":"#VALUE!"},{"$error":"#VALUE!"},"","",{"$error":"#VALUE!"},{"$f":"SUM($H$20:$H122)","v":0}]
[{"$f":"IF(Values_Entered,A122+1,\"\")","v":""},"","","",{"$error":"#VALUE!"},{"$error":"#VALUE!"},"","",{"$error":"#VALUE!"},{"$f":"SUM($H$20:$H123)","v":0}]
[{"$f":"IF(Values_Entered,A123+1,\"\")","v":""},"","","",{"$error":"#VALUE!"},{"$error":"#VALUE!"},"","",{"$error":"#VALUE!"},{"$f":"SUM($H$20:$H124)","v":0}]
[{"$f":"IF(Values_Entered,A124+1,\"\")","v":""},"","","",{"$error":"#VALUE!"},{"$error":"#VALUE!"},"","",{"$error":"#VALUE!"},{"$f":"SUM($H$20:$H125)","v":0}]
[{"$f":"IF(Values_Entered,A125+1,\"\")","v":""},"","","",{"$error":"#VALUE!"},{"$error":"#VALUE!"},"","",{"$error":"#VALUE!"},{"$f":"SUM($H$20:$H126)","v":0}]
[{"$f":"IF(Values_Entered,A126+1,\"\")","v":""},"","","",{"$error":"#VALUE!"},{"$error":"#VALUE!"},"","",{"$error":"#VALUE!"},{"$f":"SUM($H$20:$H127)","v":0}]
[{"$f":"IF(Values_Entered,A127+1,\"\")","v":""},"","","",{"$error":"#VALUE!"},{"$error":"#VALUE!"},"","",{"$error":"#VALUE!"},{"$f":"SUM($H$20:$H128)","v":0}]
[{"$f":"IF(Values_Entered,A128+1,\"\")","v":""},"","","",{"$error":"#VALUE!"},{"$error":"#VALUE!"},"","",{"$error":"#VALUE!"},{"$f":"SUM($H$20:$H129)","v":0}]
[{"$f":"IF(Values_Entered,A129+1,\"\")","v":""},"","","",{"$error":"#VALUE!"},{"$error":"#VALUE!"},"","",{"$error":"#VALUE!"},{"$f":"SUM($H$20:$H130)","v":0}]
[{"$f":"IF(Values_Entered,A130+1,\"\")","v":""},"","","",{"$error":"#VALUE!"},{"$error":"#VALUE!"},"","",{"$error":"#VALUE!"},{"$f":"SUM($H$20:$H131)","v":0}]
[{"$f":"IF(Values_Entered,A131+1,\"\")","v":""},"","","",{"$error":"#VALUE!"},{"$error":"#VALUE!"},"","",{"$error":"#VALUE!"},{"$f":"SUM($H$20:$H132)","v":0}]
[{"$f":"IF(Values_Entered,A132+1,\"\")","v":""},"","","",{"$error":"#VALUE!"},{"$error":"#VALUE!"},"","",{"$error":"#VALUE!"},{"$f":"SUM($H$20:$H133)","v":0}]
[{"$f":"IF(Values_Entered,A133+1,\"\")","v":""},"","","",{"$error":"#VALUE!"},{"$error":"#VALUE!"},"","",{"$error":"#VALUE!"},{"$f":"SUM($H$20:$H134)","v":0}]
[{"$f":"IF(Values_Entered,A134+1,\"\")","v":""},"","","",{"$error":"#VALUE!"},{"$error":"#VALUE!"},"","",{"$error":"#VALUE!"},{"$f":"SUM($H$20:$H135)","v":0}]
[{"$f":"IF(Values_Entered,A135+1,\"\")","v":""},"","","",{"$error":"#VALUE!"},{"$error":"#VALUE!"},"","",{"$error":"#VALUE!"},{"$f":"SUM($H$20:$H136)","v":0}]
[{"$f":"IF(Values_Entered,A136+1,\"\")","v":""},"","","",{"$error":"#VALUE!"},{"$error":"#VALUE!"},"","",{"$error":"#VALUE!"},{"$f":"SUM($H$20:$H137)","v":0}]
[{"$f":"IF(Values_Entered,A137+1,\"\")","v":""},"","","",{"$error":"#VALUE!"},{"$error":"#VALUE!"},"","",{"$error":"#VALUE!"},{"$f":"SUM($H$20:$H138)","v":0}]
[{"$f":"IF(Values_Entered,A138+1,\"\")","v":""},"","","",{"$error":"#VALUE!"},{"$error":"#VALUE!"},"","",{"$error":"#VALUE!"},{"$f":"SUM($H$20:$H139)","v":0}]
[{"$f":"IF(Values_Entered,A139+1,\"\")","v":""},"","","",{"$error":"#VALUE!"},{"$error":"#VALUE!"},"","",{"$error":"#VALUE!"},{"$f":"SUM($H$20:$H140)","v":0}]
[{"$f":"IF(Values_Entered,A140+1,\"\")","v":""},"","","",{"$error":"#VALUE!"},{"$error":"#VALUE!"},"","",{"$error":"#VALUE!"},{"$f":"SUM($H$20:$H141)","v":0}]
[{"$f":"IF(Values_Entered,A141+1,\"\")","v":""},"","","",{"$error":"#VALUE!"},{"$error":"#VALUE!"},"","",{"$error":"#VALUE!"},{"$f":"SUM($H$20:$H142)","v":0}]
[{"$f":"IF(Values_Entered,A142+1,\"\")","v":""},"","","",{"$error":"#VALUE!"},{"$error":"#VALUE!"},"","",{"$error":"#VALUE!"},{"$f":"SUM($H$20:$H143)","v":0}]
[{"$f":"IF(Values_Entered,A143+1,\"\")","v":""},"","","",{"$error":"#VALUE!"},{"$error":"#VALUE!"},"","",{"$error":"#VALUE!"},{"$f":"SUM($H$20:$H144)","v":0}]
[{"$f":"IF(Values_Entered,A144+1,\"\")","v":""},"","","",{"$error":"#VALUE!"},{"$error":"#VALUE!"},"","",{"$error":"#VALUE!"},{"$f":"SUM($H$20:$H145)","v":0}]
[{"$f":"IF(Values_Entered,A145+1,\"\")","v":""},"","","",{"$error":"#VALUE!"},{"$error":"#VALUE!"},"","",{"$error":"#VALUE!"},{"$f":"SUM($H$20:$H146)","v":0}]
[{"$f":"IF(Values_Entered,A146+1,\"\")","v":""},"","","",{"$error":"#VALUE!"},{"$error":"#VALUE!"},"","",{"$error":"#VALUE!"},{"$f":"SUM($H$20:$H147)","v":0}]
[{"$f":"IF(Values_Entered,A147+1,\"\")","v":""},{"$f":"IF(Pay_Num<>\"\",DATE(YEAR(Loan_Start),MONTH(Loan_Start)+(Pay_Num)*12/Num_Pmt_Per_Year,DAY(Loan_Start)),\"\")","v":""},"","",{"$f":"IF(AND(Pay_Num<>\"\",Sched_Pay+Scheduled_Extra_Payments<Beg_Bal),Scheduled_Extra_Payments,IF(AND(Pay_Num<>\"\",Beg_Bal-Sched_Pay>0),Beg_Bal-Sched_Pay,IF(Pay_Num<>\"\",0,\"\")))","v":{"$error":"#VALUE!"}},{"$f":"IF(AND(Pay_Num<>\"\",Sched_Pay+Extra_Pay<Beg_Bal),Sched_Pay+Extra_Pay,IF(Pay_Num<>\"\",Beg_Bal,\"\"))","v":{"$error":"#VALUE!"}},"","",{"$f":"IF(AND(Pay_Num<>\"\",Sched_Pay+Extra_Pay<Beg_Bal),Beg_Bal-Princ,IF(Pay_Num<>\"\",0,\"\"))","v":{"$error":"#VALUE!"}},{"$f":"SUM($H$20:$H148)","v":0}]
[{"$f":"IF(Values_Entered,A148+1,\"\")","v":""},"",{"$f":"IF(Pay_Num<>\"\",I148,\"\")","v":""},"",{"$error":"#VALUE!"},{"$error":"#VALUE!"},{"$f":"IF(Pay_Num<>\"\",Total_Pay-Int,\"\")","v":""},{"$f":"IF(Pay_Num<>\"\",Beg_Bal*Interest_Rate/Num_Pmt_Per_Year,\"\")","v":""},{"$error":"#VALUE!"},{"$f":"SUM($H$20:$H149)","v":0}]
[{"$f":"IF(Values_Entered,A149+1,\"\")","v":""},"","",{"$f":"IF(Pay_Num<>\"\",Scheduled_Monthly_Payment,\"\")","v":""},{"$error":"#VALUE!"},{"$error":"#VALUE!"},"","",{"$error":"#VALUE!"},{"$f":"SUM($H$20:$H150)","v":0}]
[{"$f":"IF(Values_Entered,A150+1,\"\")","v":""},"","","",{"$error":"#VALUE!"},{"$error":"#VALUE!"},"","",{"$error":"#VALUE!"},{"$f":"SUM($H$20:$H151)","v":0}]
[{"$f":"IF(Values_Entered,A151+1,\"\")","v":""},"","","",{"$error":"#VALUE!"},{"$error":"#VALUE!"},"","",{"$error":"#VALUE!"},{"$f":"SUM($H$20:$H152)","v":0}]
[{"$f":"IF(Values_Entered,A152+1,\"\")","v":""},"","","",{"$error":"#VALUE!"},{"$error":"#VALUE!"},"","",{"$error":"#VALUE!"},{"$f":"SUM($H$20:$H153)","v":0}]
[{"$f":"IF(Values_Entered,A153+1,\"\")","v":""},"","","",{"$error":"#VALUE!"},{"$error":"#VALUE!"},"","",{"$error":"#VALUE!"},{"$f":"SUM($H$20:$H154)","v":0}]
[{"$f":"IF(Values_Entered,A154+1,\"\")","v":""},"","","",{"$error":"#VALUE!"},{"$error":"#VALUE!"},"","",{"$error":"#VALUE!"},{"$f":"SUM($H$20:$H155)","v":0}]
[{"$f":"IF(Values_Entered,A155+1,\"\")","v":""},"","","",{"$error":"#VALUE!"},{"$error":"#VALUE!"},"","",{"$error":"#VALUE!"},{"$f":"SUM($H$20:$H156)","v":0}]
[{"$f":"IF(Values_Entered,A156+1,\"\")","v":""},"","","",{"$error":"#VALUE!"},{"$error":"#VALUE!"},"","",{"$error":"#VALUE!"},{"$f":"SUM($H$20:$H157)","v":0}]
[{"$f":"IF(Values_Entered,A157+1,\"\")","v":""},"","","",{"$error":"#VALUE!"},{"$error":"#VALUE!"},"","",{"$error":"#VALUE!"},{"$f":"SUM($H$20:$H158)","v":0}]
[{"$f":"IF(Values_Entered,A158+1,\"\")","v":""},"","","",{"$error":"#VALUE!"},{"$error":"#VALUE!"},"","",{"$error":"#VALUE!"},{"$f":"SUM($H$20:$H159)","v":0}]
[{"$f":"IF(Values_Entered,A159+1,\"\")","v":""},"","","",{"$error":"#VALUE!"},{"$error":"#VALUE!"},"","",{"$error":"#VALUE!"},{"$f":"SUM($H$20:$H160)","v":0}]
[{"$f":"IF(Values_Entered,A160+1,\"\")","v":""},"","","",{"$error":"#VALUE!"},{"$error":"#VALUE!"},"","",{"$error":"#VALUE!"},{"$f":"SUM($H$20:$H161)","v":0}]
[{"$f":"IF(Values_Entered,A161+1,\"\")","v":""},"","","",{"$error":"#VALUE!"},{"$error":"#VALUE!"},"","",{"$error":"#VALUE!"},{"$f":"SUM($H$20:$H162)","v":0}]
[{"$f":"IF(Values_Entered,A162+1,\"\")","v":""},"","","",{"$error":"#VALUE!"},{"$error":"#VALUE!"},"","",{"$error":"#VALUE!"},{"$f":"SUM($H$20:$H163)","v":0}]
[{"$f":"IF(Values_Entered,A163+1,\"\")","v":""},"","","",{"$error":"#VALUE!"},{"$error":"#VALUE!"},"","",{"$error":"#VALUE!"},{"$f":"SUM($H$20:$H164)","v":0}]
[{"$f":"IF(Values_Entered,A164+1,\"\")","v":""},"","","",{"$error":"#VALUE!"},{"$error":"#VALUE!"},"","",{"$error":"#VALUE!"},{"$f":"SUM($H$20:$H165)","v":0}]
[{"$f":"IF(Values_Entered,A165+1,\"\")","v":""},"","","",{"$error":"#VALUE!"},{"$error":"#VALUE!"},"","",{"$error":"#VALUE!"},{"$f":"SUM($H$20:$H166)","v":0}]
[{"$f":"IF(Values_Entered,A166+1,\"\")","v":""},"","","",{"$error":"#VALUE!"},{"$error":"#VALUE!"},"","",{"$error":"#VALUE!"},{"$f":"SUM($H$20:$H167)","v":0}]
[{"$f":"IF(Values_Entered,A167+1,\"\")","v":""},"","","",{"$error":"#VALUE!"},{"$error":"#VALUE!"},"","",{"$error":"#VALUE!"},{"$f":"SUM($H$20:$H168)","v":0}]
[{"$f":"IF(Values_Entered,A168+1,\"\")","v":""},"","","",{"$error":"#VALUE!"},{"$error":"#VALUE!"},"","",{"$error":"#VALUE!"},{"$f":"SUM($H$20:$H169)","v":0}]
[{"$f":"IF(Values_Entered,A169+1,\"\")","v":""},"","","",{"$error":"#VALUE!"},{"$error":"#VALUE!"},"","",{"$error":"#VALUE!"},{"$f":"SUM($H$20:$H170)","v":0}]
[{"$f":"IF(Values_Entered,A170+1,\"\")","v":""},"","","",{"$error":"#VALUE!"},{"$error":"#VALUE!"},"","",{"$error":"#VALUE!"},{"$f":"SUM($H$20:$H171)","v":0}]
[{"$f":"IF(Values_Entered,A171+1,\"\")","v":""},"","","",{"$error":"#VALUE!"},{"$error":"#VALUE!"},"","",{"$error":"#VALUE!"},{"$f":"SUM($H$20:$H172)","v":0}]
[{"$f":"IF(Values_Entered,A172+1,\"\")","v":""},"","","",{"$error":"#VALUE!"},{"$error":"#VALUE!"},"","",{"$error":"#VALUE!"},{"$f":"SUM($H$20:$H173)","v":0}]
[{"$f":"IF(Values_Entered,A173+1,\"\")","v":""},"","","",{"$error":"#VALUE!"},{"$error":"#VALUE!"},"","",{"$error":"#VALUE!"},{"$f":"SUM($H$20:$H174)","v":0}]
[{"$f":"IF(Values_Entered,A174+1,\"\")","v":""},"","","",{"$error":"#VALUE!"},{"$error":"#VALUE!"},"","",{"$error":"#VALUE!"},{"$f":"SUM($H$20:$H175)","v":0}]
[{"$f":"IF(Values_Entered,A175+1,\"\")","v":""},"","","",{"$error":"#VALUE!"},{"$error":"#VALUE!"},"","",{"$error":"#VALUE!"},{"$f":"SUM($H$20:$H176)","v":0}]
[{"$f":"IF(Values_Entered,A176+1,\"\")","v":""},"","","",{"$error":"#VALUE!"},{"$error":"#VALUE!"},"","",{"$error":"#VALUE!"},{"$f":"SUM($H$20:$H177)","v":0}]
[{"$f":"IF(Values_Entered,A177+1,\"\")","v":""},"","","",{"$error":"#VALUE!"},{"$error":"#VALUE!"},"","",{"$error":"#VALUE!"},{"$f":"SUM($H$20:$H178)","v":0}]
[{"$f":"IF(Values_Entered,A178+1,\"\")","v":""},"","","",{"$error":"#VALUE!"},{"$error":"#VALUE!"},"","",{"$error":"#VALUE!"},{"$f":"SUM($H$20:$H179)","v":0}]
[{"$f":"IF(Values_Entered,A179+1,\"\")","v":""},"","","",{"$error":"#VALUE!"},{"$error":"#VALUE!"},"","",{"$error":"#VALUE!"},{"$f":"SUM($H$20:$H180)","v":0}]
[{"$f":"IF(Values_Entered,A180+1,\"\")","v":""},"","","",{"$error":"#VALUE!"},{"$error":"#VALUE!"},"","",{"$error":"#VALUE!"},{"$f":"SUM($H$20:$H181)","v":0}]
[{"$f":"IF(Values_Entered,A181+1,\"\")","v":""},"","","",{"$error":"#VALUE!"},{"$error":"#VALUE!"},"","",{"$error":"#VALUE!"},{"$f":"SUM($H$20:$H182)","v":0}]
[{"$f":"IF(Values_Entered,A182+1,\"\")","v":""},"","","",{"$error":"#VALUE!"},{"$error":"#VALUE!"},"","",{"$error":"#VALUE!"},{"$f":"SUM($H$20:$H183)","v":0}]
[{"$f":"IF(Values_Entered,A183+1,\"\")","v":""},"","","",{"$error":"#VALUE!"},{"$error":"#VALUE!"},"","",{"$error":"#VALUE!"},{"$f":"SUM($H$20:$H184)","v":0}]
[{"$f":"IF(Values_Entered,A184+1,\"\")","v":""},"","","",{"$error":"#VALUE!"},{"$error":"#VALUE!"},"","",{"$error":"#VALUE!"},{"$f":"SUM($H$20:$H185)","v":0}]
[{"$f":"IF(Values_Entered,A185+1,\"\")","v":""},"","","",{"$error":"#VALUE!"},{"$error":"#VALUE!"},"","",{"$error":"#VALUE!"},{"$f":"SUM($H$20:$H186)","v":0}]
[{"$f":"IF(Values_Entered,A186+1,\"\")","v":""},"","","",{"$error":"#VALUE!"},{"$error":"#VALUE!"},"","",{"$error":"#VALUE!"},{"$f":"SUM($H$20:$H187)","v":0}]
[{"$f":"IF(Values_Entered,A187+1,\"\")","v":""},"","","",{"$error":"#VALUE!"},{"$error":"#VALUE!"},"","",{"$error":"#VALUE!"},{"$f":"SUM($H$20:$H188)","v":0}]
[{"$f":"IF(Values_Entered,A188+1,\"\")","v":""},"","","",{"$error":"#VALUE!"},{"$error":"#VALUE!"},"","",{"$error":"#VALUE!"},{"$f":"SUM($H$20:$H189)","v":0}]
[{"$f":"IF(Values_Entered,A189+1,\"\")","v":""},"","","",{"$error":"#VALUE!"},{"$error":"#VALUE!"},"","",{"$error":"#VALUE!"},{"$f":"SUM($H$20:$H190)","v":0}]
[{"$f":"IF(Values_Entered,A190+1,\"\")","v":""},"","","",{"$error":"#VALUE!"},{"$error":"#VALUE!"},"","",{"$error":"#VALUE!"},{"$f":"SUM($H$20:$H191)","v":0}]
[{"$f":"IF(Values_Entered,A191+1,\"\")","v":""},"","","",{"$error":"#VALUE!"},{"$error":"#VALUE!"},"","",{"$error":"#VALUE!"},{"$f":"SUM($H$20:$H192)","v":0}]
[{"$f":"IF(Values_Entered,A192+1,\"\")","v":""},"","","",{"$error":"#VALUE!"},{"$error":"#VALUE!"},"","",{"$error":"#VALUE!"},{"$f":"SUM($H$20:$H193)","v":0}]
[{"$f":"IF(Values_Entered,A193+1,\"\")","v":""},"","","",{"$error":"#VALUE!"},{"$error":"#VALUE!"},"","",{"$error":"#VALUE!"},{"$f":"SUM($H$20:$H194)","v":0}]
[{"$f":"IF(Values_Entered,A194+1,\"\")","v":""},"","","",{"$error":"#VALUE!"},{"$error":"#VALUE!"},"","",{"$error":"#VALUE!"},{"$f":"SUM($H$20:$H195)","v":0}]
[{"$f":"IF(Values_Entered,A195+1,\"\")","v":""},"","","",{"$error":"#VALUE!"},{"$error":"#VALUE!"},"","",{"$error":"#VALUE!"},{"$f":"SUM($H$20:$H196)","v":0}]
[{"$f":"IF(Values_Entered,A196+1,\"\")","v":""},"","","",{"$error":"#VALUE!"},{"$error":"#VALUE!"},"","",{"$error":"#VALUE!"},{"$f":"SUM($H$20:$H197)","v":0}]
[{"$f":"IF(Values_Entered,A197+1,\"\")","v":""},"","","",{"$error":"#VALUE!"},{"$error":"#VALUE!"},"","",{"$error":"#VALUE!"},{"$f":"SUM($H$20:$H198)","v":0}]
[{"$f":"IF(Values_Entered,A198+1,\"\")","v":""},"","","",{"$error":"#VALUE!"},{"$error":"#VALUE!"},"","",{"$error":"#VALUE!"},{"$f":"SUM($H$20:$H199)","v":0}]
[{"$f":"IF(Values_Entered,A199+1,\"\")","v":""},"","","",{"$error":"#VALUE!"},{"$error":"#VALUE!"},"","",{"$error":"#VALUE!"},{"$f":"SUM($H$20:$H200)","v":0}]
[{"$f":"IF(Values_Entered,A200+1,\"\")","v":""},"","","",{"$error":"#VALUE!"},{"$error":"#VALUE!"},"","",{"$error":"#VALUE!"},{"$f":"SUM($H$20:$H201)","v":0}]
[{"$f":"IF(Values_Entered,A201+1,\"\")","v":""},"","","",{"$error":"#VALUE!"},{"$error":"#VALUE!"},"","",{"$error":"#VALUE!"},{"$f":"SUM($H$20:$H202)","v":0}]
[{"$f":"IF(Values_Entered,A202+1,\"\")","v":""},"","","",{"$error":"#VALUE!"},{"$error":"#VALUE!"},"","",{"$error":"#VALUE!"},{"$f":"SUM($H$20:$H203)","v":0}]
[{"$f":"IF(Values_Entered,A203+1,\"\")","v":""},"","","",{"$error":"#VALUE!"},{"$error":"#VALUE!"},"","",{"$error":"#VALUE!"},{"$f":"SUM($H$20:$H204)","v":0}]
[{"$f":"IF(Values_Entered,A204+1,\"\")","v":""},"","","",{"$error":"#VALUE!"},{"$error":"#VALUE!"},"","",{"$error":"#VALUE!"},{"$f":"SUM($H$20:$H205)","v":0}]
[{"$f":"IF(Values_Entered,A205+1,\"\")","v":""},"","","",{"$error":"#VALUE!"},{"$error":"#VALUE!"},"","",{"$error":"#VALUE!"},{"$f":"SUM($H$20:$H206)","v":0}]
[{"$f":"IF(Values_Entered,A206+1,\"\")","v":""},"","","",{"$error":"#VALUE!"},{"$error":"#VALUE!"},"","",{"$error":"#VALUE!"},{"$f":"SUM($H$20:$H207)","v":0}]
[{"$f":"IF(Values_Entered,A207+1,\"\")","v":""},"","","",{"$error":"#VALUE!"},{"$error":"#VALUE!"},"","",{"$error":"#VALUE!"},{"$f":"SUM($H$20:$H208)","v":0}]
[{"$f":"IF(Values_Entered,A208+1,\"\")","v":""},"","","",{"$error":"#VALUE!"},{"$error":"#VALUE!"},"","",{"$error":"#VALUE!"},{"$f":"SUM($H$20:$H209)","v":0}]
[{"$f":"IF(Values_Entered,A209+1,\"\")","v":""},"","","",{"$error":"#VALUE!"},{"$error":"#VALUE!"},"","",{"$error":"#VALUE!"},{"$f":"SUM($H$20:$H210)","v":0}]
[{"$f":"IF(Values_Entered,A210+1,\"\")","v":""},"","","",{"$error":"#VALUE!"},{"$error":"#VALUE!"},"","",{"$error":"#VALUE!"},{"$f":"SUM($H$20:$H211)","v":0}]
[{"$f":"IF(Values_Entered,A211+1,\"\")","v":""},{"$f":"IF(Pay_Num<>\"\",DATE(YEAR(Loan_Start),MONTH(Loan_Start)+(Pay_Num)*12/Num_Pmt_Per_Year,DAY(Loan_Start)),\"\")","v":""},"","",{"$f":"IF(AND(Pay_Num<>\"\",Sched_Pay+Scheduled_Extra_Payments<Beg_Bal),Scheduled_Extra_Payments,IF(AND(Pay_Num<>\"\",Beg_Bal-Sched_Pay>0),Beg_Bal-Sched_Pay,IF(Pay_Num<>\"\",0,\"\")))","v":{"$error":"#VALUE!"}},{"$f":"IF(AND(Pay_Num<>\"\",Sched_Pay+Extra_Pay<Beg_Bal),Sched_Pay+Extra_Pay,IF(Pay_Num<>\"\",Beg_Bal,\"\"))","v":{"$error":"#VALUE!"}},"","",{"$f":"IF(AND(Pay_Num<>\"\",Sched_Pay+Extra_Pay<Beg_Bal),Beg_Bal-Princ,IF(Pay_Num<>\"\",0,\"\"))","v":{"$error":"#VALUE!"}},{"$f":"SUM($H$20:$H212)","v":0}]
[{"$f":"IF(Values_Entered,A212+1,\"\")","v":""},"",{"$f":"IF(Pay_Num<>\"\",I212,\"\")","v":""},"",{"$error":"#VALUE!"},{"$error":"#VALUE!"},{"$f":"IF(Pay_Num<>\"\",Total_Pay-Int,\"\")","v":""},{"$f":"IF(Pay_Num<>\"\",Beg_Bal*Interest_Rate/Num_Pmt_Per_Year,\"\")","v":""},{"$error":"#VALUE!"},{"$f":"SUM($H$20:$H213)","v":0}]
[{"$f":"IF(Values_Entered,A213+1,\"\")","v":""},"","",{"$f":"IF(Pay_Num<>\"\",Scheduled_Monthly_Payment,\"\")","v":""},{"$error":"#VALUE!"},{"$error":"#VALUE!"},"","",{"$error":"#VALUE!"},{"$f":"SUM($H$20:$H214)","v":0}]
[{"$f":"IF(Values_Entered,A214+1,\"\")","v":""},"","","",{"$error":"#VALUE!"},{"$error":"#VALUE!"},"","",{"$error":"#VALUE!"},{"$f":"SUM($H$20:$H215)","v":0}]
[{"$f":"IF(Values_Entered,A215+1,\"\")","v":""},"","","",{"$error":"#VALUE!"},{"$error":"#VALUE!"},"","",{"$error":"#VALUE!"},{"$f":"SUM($H$20:$H216)","v":0}]
[{"$f":"IF(Values_Entered,A216+1,\"\")","v":""},"","","",{"$error":"#VALUE!"},{"$error":"#VALUE!"},"","",{"$error":"#VALUE!"},{"$f":"SUM($H$20:$H217)","v":0}]
[{"$f":"IF(Values_Entered,A217+1,\"\")","v":""},"","","",{"$error":"#VALUE!"},{"$error":"#VALUE!"},"","",{"$error":"#VALUE!"},{"$f":"SUM($H$20:$H218)","v":0}]
[{"$f":"IF(Values_Entered,A218+1,\"\")","v":""},"","","",{"$error":"#VALUE!"},{"$error":"#VALUE!"},"","",{"$error":"#VALUE!"},{"$f":"SUM($H$20:$H219)","v":0}]
[{"$f":"IF(Values_Entered,A219+1,\"\")","v":""},"","","",{"$error":"#VALUE!"},{"$error":"#VALUE!"},"","",{"$error":"#VALUE!"},{"$f":"SUM($H$20:$H220)","v":0}]
[{"$f":"IF(Values_Entered,A220+1,\"\")","v":""},"","","",{"$error":"#VALUE!"},{"$error":"#VALUE!"},"","",{"$error":"#VALUE!"},{"$f":"SUM($H$20:$H221)","v":0}]
[{"$f":"IF(Values_Entered,A221+1,\"\")","v":""},"","","",{"$error":"#VALUE!"},{"$error":"#VALUE!"},"","",{"$error":"#VALUE!"},{"$f":"SUM($H$20:$H222)","v":0}]
[{"$f":"IF(Values_Entered,A222+1,\"\")","v":""},"","","",{"$error":"#VALUE!"},{"$error":"#VALUE!"},"","",{"$error":"#VALUE!"},{"$f":"SUM($H$20:$H223)","v":0}]
[{"$f":"IF(Values_Entered,A223+1,\"\")","v":""},"","","",{"$error":"#VALUE!"},{"$error":"#VALUE!"},"","",{"$error":"#VALUE!"},{"$f":"SUM($H$20:$H224)","v":0}]
[{"$f":"IF(Values_Entered,A224+1,\"\")","v":""},"","","",{"$error":"#VALUE!"},{"$error":"#VALUE!"},"","",{"$error":"#VALUE!"},{"$f":"SUM($H$20:$H225)","v":0}]
[{"$f":"IF(Values_Entered,A225+1,\"\")","v":""},"","","",{"$error":"#VALUE!"},{"$error":"#VALUE!"},"","",{"$error":"#VALUE!"},{"$f":"SUM($H$20:$H226)","v":0}]
[{"$f":"IF(Values_Entered,A226+1,\"\")","v":""},"","","",{"$error":"#VALUE!"},{"$error":"#VALUE!"},"","",{"$error":"#VALUE!"},{"$f":"SUM($H$20:$H227)","v":0}]
[{"$f":"IF(Values_Entered,A227+1,\"\")","v":""},"","","",{"$error":"#VALUE!"},{"$error":"#VALUE!"},"","",{"$error":"#VALUE!"},{"$f":"SUM($H$20:$H228)","v":0}]
[{"$f":"IF(Values_Entered,A228+1,\"\")","v":""},"","","",{"$error":"#VALUE!"},{"$error":"#VALUE!"},"","",{"$error":"#VALUE!"},{"$f":"SUM($H$20:$H229)","v":0}]
[{"$f":"IF(Values_Entered,A229+1,\"\")","v":""},"","","",{"$error":"#VALUE!"},{"$error":"#VALUE!"},"","",{"$error":"#VALUE!"},{"$f":"SUM($H$20:$H230)","v":0}]
[{"$f":"IF(Values_Entered,A230+1,\"\")","v":""},"","","",{"$error":"#VALUE!"},{"$error":"#VALUE!"},"","",{"$error":"#VALUE!"},{"$f":"SUM($H$20:$H231)","v":0}]
[{"$f":"IF(Values_Entered,A231+1,\"\")","v":""},"","","",{"$error":"#VALUE!"},{"$error":"#VALUE!"},"","",{"$error":"#VALUE!"},{"$f":"SUM($H$20:$H232)","v":0}]
[{"$f":"IF(Values_Entered,A232+1,\"\")","v":""},"","","",{"$error":"#VALUE!"},{"$error":"#VALUE!"},"","",{"$error":"#VALUE!"},{"$f":"SUM($H$20:$H233)","v":0}]
[{"$f":"IF(Values_Entered,A233+1,\"\")","v":""},"","","",{"$error":"#VALUE!"},{"$error":"#VALUE!"},"","",{"$error":"#VALUE!"},{"$f":"SUM($H$20:$H234)","v":0}]
[{"$f":"IF(Values_Entered,A234+1,\"\")","v":""},"","","",{"$error":"#VALUE!"},{"$error":"#VALUE!"},"","",{"$error":"#VALUE!"},{"$f":"SUM($H$20:$H235)","v":0}]
[{"$f":"IF(Values_Entered,A235+1,\"\")","v":""},"","","",{"$error":"#VALUE!"},{"$error":"#VALUE!"},"","",{"$error":"#VALUE!"},{"$f":"SUM($H$20:$H236)","v":0}]
[{"$f":"IF(Values_Entered,A236+1,\"\")","v":""},"","","",{"$error":"#VALUE!"},{"$error":"#VALUE!"},"","",{"$error":"#VALUE!"},{"$f":"SUM($H$20:$H237)","v":0}]
[{"$f":"IF(Values_Entered,A237+1,\"\")","v":""},"","","",{"$error":"#VALUE!"},{"$error":"#VALUE!"},"","",{"$error":"#VALUE!"},{"$f":"SUM($H$20:$H238)","v":0}]
[{"$f":"IF(Values_Entered,A238+1,\"\")","v":""},"","","",{"$error":"#VALUE!"},{"$error":"#VALUE!"},"","",{"$error":"#VALUE!"},{"$f":"SUM($H$20:$H239)","v":0}]
[{"$f":"IF(Values_Entered,A239+1,\"\")","v":""},"","","",{"$error":"#VALUE!"},{"$error":"#VALUE!"},"","",{"$error":"#VALUE!"},{"$f":"SUM($H$20:$H240)","v":0}]
[{"$f":"IF(Values_Entered,A240+1,\"\")","v":""},"","","",{"$error":"#VALUE!"},{"$error":"#VALUE!"},"","",{"$error":"#VALUE!"},{"$f":"SUM($H$20:$H241)","v":0}]
[{"$f":"IF(Values_Entered,A241+1,\"\")","v":""},"","","",{"$error":"#VALUE!"},{"$error":"#VALUE!"},"","",{"$error":"#VALUE!"},{"$f":"SUM($H$20:$H242)","v":0}]
[{"$f":"IF(Values_Entered,A242+1,\"\")","v":""},"","","",{"$error":"#VALUE!"},{"$error":"#VALUE!"},"","",{"$error":"#VALUE!"},{"$f":"SUM($H$20:$H243)","v":0}]
[{"$f":"IF(Values_Entered,A243+1,\"\")","v":""},"","","",{"$error":"#VALUE!"},{"$error":"#VALUE!"},"","",{"$error":"#VALUE!"},{"$f":"SUM($H$20:$H244)","v":0}]
[{"$f":"IF(Values_Entered,A244+1,\"\")","v":""},"","","",{"$error":"#VALUE!"},{"$error":"#VALUE!"},"","",{"$error":"#VALUE!"},{"$f":"SUM($H$20:$H245)","v":0}]
[{"$f":"IF(Values_Entered,A245+1,\"\")","v":""},"","","",{"$error":"#VALUE!"},{"$error":"#VALUE!"},"","",{"$error":"#VALUE!"},{"$f":"SUM($H$20:$H246)","v":0}]
[{"$f":"IF(Values_Entered,A246+1,\"\")","v":""},"","","",{"$error":"#VALUE!"},{"$error":"#VALUE!"},"","",{"$error":"#VALUE!"},{"$f":"SUM($H$20:$H247)","v":0}]
[{"$f":"IF(Values_Entered,A247+1,\"\")","v":""},"","","",{"$error":"#VALUE!"},{"$error":"#VALUE!"},"","",{"$error":"#VALUE!"},{"$f":"SUM($H$20:$H248)","v":0}]
[{"$f":"IF(Values_Entered,A248+1,\"\")","v":""},"","","",{"$error":"#VALUE!"},{"$error":"#VALUE!"},"","",{"$error":"#VALUE!"},{"$f":"SUM($H$20:$H249)","v":0}]
[{"$f":"IF(Values_Entered,A249+1,\"\")","v":""},"","","",{"$error":"#VALUE!"},{"$error":"#VALUE!"},"","",{"$error":"#VALUE!"},{"$f":"SUM($H$20:$H250)","v":0}]
[{"$f":"IF(Values_Entered,A250+1,\"\")","v":""},"","","",{"$error":"#VALUE!"},{"$error":"#VALUE!"},"","",{"$error":"#VALUE!"},{"$f":"SUM($H$20:$H251)","v":0}]
[{"$f":"IF(Values_Entered,A251+1,\"\")","v":""},"","","",{"$error":"#VALUE!"},{"$error":"#VALUE!"},"","",{"$error":"#VALUE!"},{"$f":"SUM($H$20:$H252)","v":0}]
[{"$f":"IF(Values_Entered,A252+1,\"\")","v":""},"","","",{"$error":"#VALUE!"},{"$error":"#VALUE!"},"","",{"$error":"#VALUE!"},{"$f":"SUM($H$20:$H253)","v":0}]
[{"$f":"IF(Values_Entered,A253+1,\"\")","v":""},"","","",{"$error":"#VALUE!"},{"$error":"#VALUE!"},"","",{"$error":"#VALUE!"},{"$f":"SUM($H$20:$H254)","v":0}]
[{"$f":"IF(Values_Entered,A254+1,\"\")","v":""},"","","",{"$error":"#VALUE!"},{"$error":"#VALUE!"},"","",{"$error":"#VALUE!"},{"$f":"SUM($H$20:$H255)","v":0}]
[{"$f":"IF(Values_Entered,A255+1,\"\")","v":""},"","","",{"$error":"#VALUE!"},{"$error":"#VALUE!"},"","",{"$error":"#VALUE!"},{"$f":"SUM($H$20:$H256)","v":0}]
[{"$f":"IF(Values_Entered,A256+1,\"\")","v":""},"","","",{"$error":"#VALUE!"},{"$error":"#VALUE!"},"","",{"$error":"#VALUE!"},{"$f":"SUM($H$20:$H257)","v":0}]
[{"$f":"IF(Values_Entered,A257+1,\"\")","v":""},"","","",{"$error":"#VALUE!"},{"$error":"#VALUE!"},"","",{"$error":"#VALUE!"},{"$f":"SUM($H$20:$H258)","v":0}]
[{"$f":"IF(Values_Entered,A258+1,\"\")","v":""},"","","",{"$error":"#VALUE!"},{"$error":"#VALUE!"},"","",{"$error":"#VALUE!"},{"$f":"SUM($H$20:$H259)","v":0}]
[{"$f":"IF(Values_Entered,A259+1,\"\")","v":""},"","","",{"$error":"#VALUE!"},{"$error":"#VALUE!"},"","",{"$error":"#VALUE!"},{"$f":"SUM($H$20:$H260)","v":0}]
[{"$f":"IF(Values_Entered,A260+1,\"\")","v":""},"","","",{"$error":"#VALUE!"},{"$error":"#VALUE!"},"","",{"$error":"#VALUE!"},{"$f":"SUM($H$20:$H261)","v":0}]
[{"$f":"IF(Values_Entered,A261+1,\"\")","v":""},"","","",{"$error":"#VALUE!"},{"$error":"#VALUE!"},"","",{"$error":"#VALUE!"},{"$f":"SUM($H$20:$H262)","v":0}]
[{"$f":"IF(Values_Entered,A262+1,\"\")","v":""},"","","",{"$error":"#VALUE!"},{"$error":"#VALUE!"},"","",{"$error":"#VALUE!"},{"$f":"SUM($H$20:$H263)","v":0}]
[{"$f":"IF(Values_Entered,A263+1,\"\")","v":""},"","","",{"$error":"#VALUE!"},{"$error":"#VALUE!"},"","",{"$error":"#VALUE!"},{"$f":"SUM($H$20:$H264)","v":0}]
[{"$f":"IF(Values_Entered,A264+1,\"\")","v":""},"","","",{"$error":"#VALUE!"},{"$error":"#VALUE!"},"","",{"$error":"#VALUE!"},{"$f":"SUM($H$20:$H265)","v":0}]
[{"$f":"IF(Values_Entered,A265+1,\"\")","v":""},"","","",{"$error":"#VALUE!"},{"$error":"#VALUE!"},"","",{"$error":"#VALUE!"},{"$f":"SUM($H$20:$H266)","v":0}]
[{"$f":"IF(Values_Entered,A266+1,\"\")","v":""},"","","",{"$error":"#VALUE!"},{"$error":"#VALUE!"},"","",{"$error":"#VALUE!"},{"$f":"SUM($H$20:$H267)","v":0}]
[{"$f":"IF(Values_Entered,A267+1,\"\")","v":""},"","","",{"$error":"#VALUE!"},{"$error":"#VALUE!"},"","",{"$error":"#VALUE!"},{"$f":"SUM($H$20:$H268)","v":0}]
[{"$f":"IF(Values_Entered,A268+1,\"\")","v":""},"","","",{"$error":"#VALUE!"},{"$error":"#VALUE!"},"","",{"$error":"#VALUE!"},{"$f":"SUM($H$20:$H269)","v":0}]
[{"$f":"IF(Values_Entered,A269+1,\"\")","v":""},"","","",{"$error":"#VALUE!"},{"$error":"#VALUE!"},"","",{"$error":"#VALUE!"},{"$f":"SUM($H$20:$H270)","v":0}]
[{"$f":"IF(Values_Entered,A270+1,\"\")","v":""},"","","",{"$error":"#VALUE!"},{"$error":"#VALUE!"},"","",{"$error":"#VALUE!"},{"$f":"SUM($H$20:$H271)","v":0}]
[{"$f":"IF(Values_Entered,A271+1,\"\")","v":""},"","","",{"$error":"#VALUE!"},{"$error":"#VALUE!"},"","",{"$error":"#VALUE!"},{"$f":"SUM($H$20:$H272)","v":0}]
[{"$f":"IF(Values_Entered,A272+1,\"\")","v":""},"","","",{"$error":"#VALUE!"},{"$error":"#VALUE!"},"","",{"$error":"#VALUE!"},{"$f":"SUM($H$20:$H273)","v":0}]
[{"$f":"IF(Values_Entered,A273+1,\"\")","v":""},"","","",{"$error":"#VALUE!"},{"$error":"#VALUE!"},"","",{"$error":"#VALUE!"},{"$f":"SUM($H$20:$H274)","v":0}]
[{"$f":"IF(Values_Entered,A274+1,\"\")","v":""},"","","",{"$error":"#VALUE!"},{"$error":"#VALUE!"},"","",{"$error":"#VALUE!"},{"$f":"SUM($H$20:$H275)","v":0}]
[{"$f":"IF(Values_Entered,A275+1,\"\")","v":""},{"$f":"IF(Pay_Num<>\"\",DATE(YEAR(Loan_Start),MONTH(Loan_Start)+(Pay_Num)*12/Num_Pmt_Per_Year,DAY(Loan_Start)),\"\")","v":""},"","",{"$f":"IF(AND(Pay_Num<>\"\",Sched_Pay+Scheduled_Extra_Payments<Beg_Bal),Scheduled_Extra_Payments,IF(AND(Pay_Num<>\"\",Beg_Bal-Sched_Pay>0),Beg_Bal-Sched_Pay,IF(Pay_Num<>\"\",0,\"\")))","v":{"$error":"#VALUE!"}},{"$f":"IF(AND(Pay_Num<>\"\",Sched_Pay+Extra_Pay<Beg_Bal),Sched_Pay+Extra_Pay,IF(Pay_Num<>\"\",Beg_Bal,\"\"))","v":{"$error":"#VALUE!"}},"","",{"$f":"IF(AND(Pay_Num<>\"\",Sched_Pay+Extra_Pay<Beg_Bal),Beg_Bal-Princ,IF(Pay_Num<>\"\",0,\"\"))","v":{"$error":"#VALUE!"}},{"$f":"SUM($H$20:$H276)","v":0}]
[{"$f":"IF(Values_Entered,A276+1,\"\")","v":""},"",{"$f":"IF(Pay_Num<>\"\",I276,\"\")","v":""},"",{"$error":"#VALUE!"},{"$error":"#VALUE!"},{"$f":"IF(Pay_Num<>\"\",Total_Pay-Int,\"\")","v":""},{"$f":"IF(Pay_Num<>\"\",Beg_Bal*Interest_Rate/Num_Pmt_Per_Year,\"\")","v":""},{"$error":"#VALUE!"},{"$f":"SUM($H$20:$H277)","v":0}]
[{"$f":"IF(Values_Entered,A277+1,\"\")","v":""},"","",{"$f":"IF(Pay_Num<>\"\",Scheduled_Monthly_Payment,\"\")","v":""},{"$error":"#VALUE!"},{"$error":"#VALUE!"},"","",{"$error":"#VALUE!"},{"$f":"SUM($H$20:$H278)","v":0}]
[{"$f":"IF(Values_Entered,A278+1,\"\")","v":""},"","","",{"$error":"#VALUE!"},{"$error":"#VALUE!"},"","",{"$error":"#VALUE!"},{"$f":"SUM($H$20:$H279)","v":0}]
[{"$f":"IF(Values_Entered,A279+1,\"\")","v":""},"","","",{"$error":"#VALUE!"},{"$error":"#VALUE!"},"","",{"$error":"#VALUE!"},{"$f":"SUM($H$20:$H280)","v":0}]
[{"$f":"IF(Values_Entered,A280+1,\"\")","v":""},"","","",{"$error":"#VALUE!"},{"$error":"#VALUE!"},"","",{"$error":"#VALUE!"},{"$f":"SUM($H$20:$H281)","v":0}]
[{"$f":"IF(Values_Entered,A281+1,\"\")","v":""},"","","",{"$error":"#VALUE!"},{"$error":"#VALUE!"},"","",{"$error":"#VALUE!"},{"$f":"SUM($H$20:$H282)","v":0}]
[{"$f":"IF(Values_Entered,A282+1,\"\")","v":""},"","","",{"$error":"#VALUE!"},{"$error":"#VALUE!"},"","",{"$error":"#VALUE!"},{"$f":"SUM($H$20:$H283)","v":0}]
[{"$f":"IF(Values_Entered,A283+1,\"\")","v":""},"","","",{"$error":"#VALUE!"},{"$error":"#VALUE!"},"","",{"$error":"#VALUE!"},{"$f":"SUM($H$20:$H284)","v":0}]
[{"$f":"IF(Values_Entered,A284+1,\"\")","v":""},"","","",{"$error":"#VALUE!"},{"$error":"#VALUE!"},"","",{"$error":"#VALUE!"},{"$f":"SUM($H$20:$H285)","v":0}]
[{"$f":"IF(Values_Entered,A285+1,\"\")","v":""},"","","",{"$error":"#VALUE!"},{"$error":"#VALUE!"},"","",{"$error":"#VALUE!"},{"$f":"SUM($H$20:$H286)","v":0}]
[{"$f":"IF(Values_Entered,A286+1,\"\")","v":""},"","","",{"$error":"#VALUE!"},{"$error":"#VALUE!"},"","",{"$error":"#VALUE!"},{"$f":"SUM($H$20:$H287)","v":0}]
[{"$f":"IF(Values_Entered,A287+1,\"\")","v":""},"","","",{"$error":"#VALUE!"},{"$error":"#VALUE!"},"","",{"$error":"#VALUE!"},{"$f":"SUM($H$20:$H288)","v":0}]
[{"$f":"IF(Values_Entered,A288+1,\"\")","v":""},"","","",{"$error":"#VALUE!"},{"$error":"#VALUE!"},"","",{"$error":"#VALUE!"},{"$f":"SUM($H$20:$H289)","v":0}]
[{"$f":"IF(Values_Entered,A289+1,\"\")","v":""},"","","",{"$error":"#VALUE!"},{"$error":"#VALUE!"},"","",{"$error":"#VALUE!"},{"$f":"SUM($H$20:$H290)","v":0}]
[{"$f":"IF(Values_Entered,A290+1,\"\")","v":""},"","","",{"$error":"#VALUE!"},{"$error":"#VALUE!"},"","",{"$error":"#VALUE!"},{"$f":"SUM($H$20:$H291)","v":0}]
[{"$f":"IF(Values_Entered,A291+1,\"\")","v":""},"","","",{"$error":"#VALUE!"},{"$error":"#VALUE!"},"","",{"$error":"#VALUE!"},{"$f":"SUM($H$20:$H292)","v":0}]
[{"$f":"IF(Values_Entered,A292+1,\"\")","v":""},"","","",{"$error":"#VALUE!"},{"$error":"#VALUE!"},"","",{"$error":"#VALUE!"},{"$f":"SUM($H$20:$H293)","v":0}]
[{"$f":"IF(Values_Entered,A293+1,\"\")","v":""},"","","",{"$error":"#VALUE!"},{"$error":"#VALUE!"},"","",{"$error":"#VALUE!"},{"$f":"SUM($H$20:$H294)","v":0}]
[{"$f":"IF(Values_Entered,A294+1,\"\")","v":""},"","","",{"$error":"#VALUE!"},{"$error":"#VALUE!"},"","",{"$error":"#VALUE!"},{"$f":"SUM($H$20:$H295)","v":0}]
[{"$f":"IF(Values_Entered,A295+1,\"\")","v":""},"","","",{"$error":"#VALUE!"},{"$error":"#VALUE!"},"","",{"$error":"#VALUE!"},{"$f":"SUM($H$20:$H296)","v":0}]
[{"$f":"IF(Values_Entered,A296+1,\"\")","v":""},"","","",{"$error":"#VALUE!"},{"$error":"#VALUE!"},"","",{"$error":"#VALUE!"},{"$f":"SUM($H$20:$H297)","v":0}]
[{"$f":"IF(Values_Entered,A297+1,\"\")","v":""},"","","",{"$error":"#VALUE!"},{"$error":"#VALUE!"},"","",{"$error":"#VALUE!"},{"$f":"SUM($H$20:$H298)","v":0}]
[{"$f":"IF(Values_Entered,A298+1,\"\")","v":""},"","","",{"$error":"#VALUE!"},{"$error":"#VALUE!"},"","",{"$error":"#VALUE!"},{"$f":"SUM($H$20:$H299)","v":0}]
[{"$f":"IF(Values_Entered,A299+1,\"\")","v":""},"","","",{"$error":"#VALUE!"},{"$error":"#VALUE!"},"","",{"$error":"#VALUE!"},{"$f":"SUM($H$20:$H300)","v":0}]
[{"$f":"IF(Values_Entered,A300+1,\"\")","v":""},"","","",{"$error":"#VALUE!"},{"$error":"#VALUE!"},"","",{"$error":"#VALUE!"},{"$f":"SUM($H$20:$H301)","v":0}]
[{"$f":"IF(Values_Entered,A301+1,\"\")","v":""},"","","",{"$error":"#VALUE!"},{"$error":"#VALUE!"},"","",{"$error":"#VALUE!"},{"$f":"SUM($H$20:$H302)","v":0}]
[{"$f":"IF(Values_Entered,A302+1,\"\")","v":""},"","","",{"$error":"#VALUE!"},{"$error":"#VALUE!"},"","",{"$error":"#VALUE!"},{"$f":"SUM($H$20:$H303)","v":0}]
[{"$f":"IF(Values_Entered,A303+1,\"\")","v":""},"","","",{"$error":"#VALUE!"},{"$error":"#VALUE!"},"","",{"$error":"#VALUE!"},{"$f":"SUM($H$20:$H304)","v":0}]
[{"$f":"IF(Values_Entered,A304+1,\"\")","v":""},"","","",{"$error":"#VALUE!"},{"$error":"#VALUE!"},"","",{"$error":"#VALUE!"},{"$f":"SUM($H$20:$H305)","v":0}]
[{"$f":"IF(Values_Entered,A305+1,\"\")","v":""},"","","",{"$error":"#VALUE!"},{"$error":"#VALUE!"},"","",{"$error":"#VALUE!"},{"$f":"SUM($H$20:$H306)","v":0}]
[{"$f":"IF(Values_Entered,A306+1,\"\")","v":""},"","","",{"$error":"#VALUE!"},{"$error":"#VALUE!"},"","",{"$error":"#VALUE!"},{"$f":"SUM($H$20:$H307)","v":0}]
[{"$f":"IF(Values_Entered,A307+1,\"\")","v":""},"","","",{"$error":"#VALUE!"},{"$error":"#VALUE!"},"","",{"$error":"#VALUE!"},{"$f":"SUM($H$20:$H308)","v":0}]
[{"$f":"IF(Values_Entered,A308+1,\"\")","v":""},"","","",{"$error":"#VALUE!"},{"$error":"#VALUE!"},"","",{"$error":"#VALUE!"},{"$f":"SUM($H$20:$H309)","v":0}]
[{"$f":"IF(Values_Entered,A309+1,\"\")","v":""},"","","",{"$error":"#VALUE!"},{"$error":"#VALUE!"},"","",{"$error":"#VALUE!"},{"$f":"SUM($H$20:$H310)","v":0}]
[{"$f":"IF(Values_Entered,A310+1,\"\")","v":""},"","","",{"$error":"#VALUE!"},{"$error":"#VALUE!"},"","",{"$error":"#VALUE!"},{"$f":"SUM($H$20:$H311)","v":0}]
[{"$f":"IF(Values_Entered,A311+1,\"\")","v":""},"","","",{"$error":"#VALUE!"},{"$error":"#VALUE!"},"","",{"$error":"#VALUE!"},{"$f":"SUM($H$20:$H312)","v":0}]
[{"$f":"IF(Values_Entered,A312+1,\"\")","v":""},"","","",{"$error":"#VALUE!"},{"$error":"#VALUE!"},"","",{"$error":"#VALUE!"},{"$f":"SUM($H$20:$H313)","v":0}]
[{"$f":"IF(Values_Entered,A313+1,\"\")","v":""},"","","",{"$error":"#VALUE!"},{"$error":"#VALUE!"},"","",{"$error":"#VALUE!"},{"$f":"SUM($H$20:$H314)","v":0}]
[{"$f":"IF(Values_Entered,A314+1,\"\")","v":""},"","","",{"$error":"#VALUE!"},{"$error":"#VALUE!"},"","",{"$error":"#VALUE!"},{"$f":"SUM($H$20:$H315)","v":0}]
[{"$f":"IF(Values_Entered,A315+1,\"\")","v":""},"","","",{"$error":"#VALUE!"},{"$error":"#VALUE!"},"","",{"$error":"#VALUE!"},{"$f":"SUM($H$20:$H316)","v":0}]
[{"$f":"IF(Values_Entered,A316+1,\"\")","v":""},"","","",{"$error":"#VALUE!"},{"$error":"#VALUE!"},"","",{"$error":"#VALUE!"},{"$f":"SUM($H$20:$H317)","v":0}]
[{"$f":"IF(Values_Entered,A317+1,\"\")","v":""},"","","",{"$error":"#VALUE!"},{"$error":"#VALUE!"},"","",{"$error":"#VALUE!"},{"$f":"SUM($H$20:$H318)","v":0}]
[{"$f":"IF(Values_Entered,A318+1,\"\")","v":""},"","","",{"$error":"#VALUE!"},{"$error":"#VALUE!"},"","",{"$error":"#VALUE!"},{"$f":"SUM($H$20:$H319)","v":0}]
[{"$f":"IF(Values_Entered,A319+1,\"\")","v":""},"","","",{"$error":"#VALUE!"},{"$error":"#VALUE!"},"","",{"$error":"#VALUE!"},{"$f":"SUM($H$20:$H320)","v":0}]
[{"$f":"IF(Values_Entered,A320+1,\"\")","v":""},"","","",{"$error":"#VALUE!"},{"$error":"#VALUE!"},"","",{"$error":"#VALUE!"},{"$f":"SUM($H$20:$H321)","v":0}]
[{"$f":"IF(Values_Entered,A321+1,\"\")","v":""},"","","",{"$error":"#VALUE!"},{"$error":"#VALUE!"},"","",{"$error":"#VALUE!"},{"$f":"SUM($H$20:$H322)","v":0}]
[{"$f":"IF(Values_Entered,A322+1,\"\")","v":""},"","","",{"$error":"#VALUE!"},{"$error":"#VALUE!"},"","",{"$error":"#VALUE!"},{"$f":"SUM($H$20:$H323)","v":0}]
[{"$f":"IF(Values_Entered,A323+1,\"\")","v":""},"","","",{"$error":"#VALUE!"},{"$error":"#VALUE!"},"","",{"$error":"#VALUE!"},{"$f":"SUM($H$20:$H324)","v":0}]
[{"$f":"IF(Values_Entered,A324+1,\"\")","v":""},"","","",{"$error":"#VALUE!"},{"$error":"#VALUE!"},"","",{"$error":"#VALUE!"},{"$f":"SUM($H$20:$H325)","v":0}]
[{"$f":"IF(Values_Entered,A325+1,\"\")","v":""},"","","",{"$error":"#VALUE!"},{"$error":"#VALUE!"},"","",{"$error":"#VALUE!"},{"$f":"SUM($H$20:$H326)","v":0}]
[{"$f":"IF(Values_Entered,A326+1,\"\")","v":""},"","","",{"$error":"#VALUE!"},{"$error":"#VALUE!"},"","",{"$error":"#VALUE!"},{"$f":"SUM($H$20:$H327)","v":0}]
[{"$f":"IF(Values_Entered,A327+1,\"\")","v":""},"","","",{"$error":"#VALUE!"},{"$error":"#VALUE!"},"","",{"$error":"#VALUE!"},{"$f":"SUM($H$20:$H328)","v":0}]
[{"$f":"IF(Values_Entered,A328+1,\"\")","v":""},"","","",{"$error":"#VALUE!"},{"$error":"#VALUE!"},"","",{"$error":"#VALUE!"},{"$f":"SUM($H$20:$H329)","v":0}]
[{"$f":"IF(Values_Entered,A329+1,\"\")","v":""},"","","",{"$error":"#VALUE!"},{"$error":"#VALUE!"},"","",{"$error":"#VALUE!"},{"$f":"SUM($H$20:$H330)","v":0}]
[{"$f":"IF(Values_Entered,A330+1,\"\")","v":""},"","","",{"$error":"#VALUE!"},{"$error":"#VALUE!"},"","",{"$error":"#VALUE!"},{"$f":"SUM($H$20:$H331)","v":0}]
[{"$f":"IF(Values_Entered,A331+1,\"\")","v":""},"","","",{"$error":"#VALUE!"},{"$error":"#VALUE!"},"","",{"$error":"#VALUE!"},{"$f":"SUM($H$20:$H332)","v":0}]
[{"$f":"IF(Values_Entered,A332+1,\"\")","v":""},"","","",{"$error":"#VALUE!"},{"$error":"#VALUE!"},"","",{"$error":"#VALUE!"},{"$f":"SUM($H$20:$H333)","v":0}]
[{"$f":"IF(Values_Entered,A333+1,\"\")","v":""},"","","",{"$error":"#VALUE!"},{"$error":"#VALUE!"},"","",{"$error":"#VALUE!"},{"$f":"SUM($H$20:$H334)","v":0}]
[{"$f":"IF(Values_Entered,A334+1,\"\")","v":""},"","","",{"$error":"#VALUE!"},{"$error":"#VALUE!"},"","",{"$error":"#VALUE!"},{"$f":"SUM($H$20:$H335)","v":0}]
[{"$f":"IF(Values_Entered,A335+1,\"\")","v":""},"","","",{"$error":"#VALUE!"},{"$error":"#VALUE!"},"","",{"$error":"#VALUE!"},{"$f":"SUM($H$20:$H336)","v":0}]
[{"$f":"IF(Values_Entered,A336+1,\"\")","v":""},"","","",{"$error":"#VALUE!"},{"$error":"#VALUE!"},"","",{"$error":"#VALUE!"},{"$f":"SUM($H$20:$H337)","v":0}]
[{"$f":"IF(Values_Entered,A337+1,\"\")","v":""},"","","",{"$error":"#VALUE!"},{"$error":"#VALUE!"},"","",{"$error":"#VALUE!"},{"$f":"SUM($H$20:$H338)","v":0}]
[{"$f":"IF(Values_Entered,A338+1,\"\")","v":""},"","","",{"$error":"#VALUE!"},{"$error":"#VALUE!"},"","",{"$error":"#VALUE!"},{"$f":"SUM($H$20:$H339)","v":0}]
[{"$f":"IF(Values_Entered,A339+1,\"\")","v":""},{"$f":"IF(Pay_Num<>\"\",DATE(YEAR(Loan_Start),MONTH(Loan_Start)+(Pay_Num)*12/Num_Pmt_Per_Year,DAY(Loan_Start)),\"\")","v":""},"","",{"$f":"IF(AND(Pay_Num<>\"\",Sched_Pay+Scheduled_Extra_Payments<Beg_Bal),Scheduled_Extra_Payments,IF(AND(Pay_Num<>\"\",Beg_Bal-Sched_Pay>0),Beg_Bal-Sched_Pay,IF(Pay_Num<>\"\",0,\"\")))","v":{"$error":"#VALUE!"}},{"$f":"IF(AND(Pay_Num<>\"\",Sched_Pay+Extra_Pay<Beg_Bal),Sched_Pay+Extra_Pay,IF(Pay_Num<>\"\",Beg_Bal,\"\"))","v":{"$error":"#VALUE!"}},"","",{"$f":"IF(AND(Pay_Num<>\"\",Sched_Pay+Extra_Pay<Beg_Bal),Beg_Bal-Princ,IF(Pay_Num<>\"\",0,\"\"))","v":{"$error":"#VALUE!"}},{"$f":"SUM($H$20:$H340)","v":0}]
[{"$f":"IF(Values_Entered,A340+1,\"\")","v":""},"",{"$f":"IF(Pay_Num<>\"\",I340,\"\")","v":""},"",{"$error":"#VALUE!"},{"$error":"#VALUE!"},{"$f":"IF(Pay_Num<>\"\",Total_Pay-Int,\"\")","v":""},{"$f":"IF(Pay_Num<>\"\",Beg_Bal*Interest_Rate/Num_Pmt_Per_Year,\"\")","v":""},{"$error":"#VALUE!"},{"$f":"SUM($H$20:$H341)","v":0}]
[{"$f":"IF(Values_Entered,A341+1,\"\")","v":""},"","",{"$f":"IF(Pay_Num<>\"\",Scheduled_Monthly_Payment,\"\")","v":""},{"$error":"#VALUE!"},{"$error":"#VALUE!"},"","",{"$error":"#VALUE!"},{"$f":"SUM($H$20:$H342)","v":0}]
[{"$f":"IF(Values_Entered,A342+1,\"\")","v":""},"","","",{"$error":"#VALUE!"},{"$error":"#VALUE!"},"","",{"$error":"#VALUE!"},{"$f":"SUM($H$20:$H343)","v":0}]
[{"$f":"IF(Values_Entered,A343+1,\"\")","v":""},"","","",{"$error":"#VALUE!"},{"$error":"#VALUE!"},"","",{"$error":"#VALUE!"},{"$f":"SUM($H$20:$H344)","v":0}]
[{"$f":"IF(Values_Entered,A344+1,\"\")","v":""},"","","",{"$error":"#VALUE!"},{"$error":"#VALUE!"},"","",{"$error":"#VALUE!"},{"$f":"SUM($H$20:$H345)","v":0}]
[{"$f":"IF(Values_Entered,A345+1,\"\")","v":""},"","","",{"$error":"#VALUE!"},{"$error":"#VALUE!"},"","",{"$error":"#VALUE!"},{"$f":"SUM($H$20:$H346)","v":0}]
[{"$f":"IF(Values_Entered,A346+1,\"\")","v":""},"","","",{"$error":"#VALUE!"},{"$error":"#VALUE!"},"","",{"$error":"#VALUE!"},{"$f":"SUM($H$20:$H347)","v":0}]
[{"$f":"IF(Values_Entered,A347+1,\"\")","v":""},"","","",{"$error":"#VALUE!"},{"$error":"#VALUE!"},"","",{"$error":"#VALUE!"},{"$f":"SUM($H$20:$H348)","v":0}]
[{"$f":"IF(Values_Entered,A348+1,\"\")","v":""},"","","",{"$error":"#VALUE!"},{"$error":"#VALUE!"},"","",{"$error":"#VALUE!"},{"$f":"SUM($H$20:$H349)","v":0}]
[{"$f":"IF(Values_Entered,A349+1,\"\")","v":""},"","","",{"$error":"#VALUE!"},{"$error":"#VALUE!"},"","",{"$error":"#VALUE!"},{"$f":"SUM($H$20:$H350)","v":0}]
[{"$f":"IF(Values_Entered,A350+1,\"\")","v":""},"","","",{"$error":"#VALUE!"},{"$error":"#VALUE!"},"","",{"$error":"#VALUE!"},{"$f":"SUM($H$20:$H351)","v":0}]
[{"$f":"IF(Values_Entered,A351+1,\"\")","v":""},"","","",{"$error":"#VALUE!"},{"$error":"#VALUE!"},"","",{"$error":"#VALUE!"},{"$f":"SUM($H$20:$H352)","v":0}]
[{"$f":"IF(Values_Entered,A352+1,\"\")","v":""},"","","",{"$error":"#VALUE!"},{"$error":"#VALUE!"},"","",{"$error":"#VALUE!"},{"$f":"SUM($H$20:$H353)","v":0}]
[{"$f":"IF(Values_Entered,A353+1,\"\")","v":""},"","","",{"$error":"#VALUE!"},{"$error":"#VALUE!"},"","",{"$error":"#VALUE!"},{"$f":"SUM($H$20:$H354)","v":0}]
[{"$f":"IF(Values_Entered,A354+1,\"\")","v":""},"","","",{"$error":"#VALUE!"},{"$error":"#VALUE!"},"","",{"$error":"#VALUE!"},{"$f":"SUM($H$20:$H355)","v":0}]
[{"$f":"IF(Values_Entered,A355+1,\"\")","v":""},"","","",{"$error":"#VALUE!"},{"$error":"#VALUE!"},"","",{"$error":"#VALUE!"},{"$f":"SUM($H$20:$H356)","v":0}]
[{"$f":"IF(Values_Entered,A356+1,\"\")","v":""},"","","",{"$error":"#VALUE!"},{"$error":"#VALUE!"},"","",{"$error":"#VALUE!"},{"$f":"SUM($H$20:$H357)","v":0}]
[{"$f":"IF(Values_Entered,A357+1,\"\")","v":""},"","","",{"$error":"#VALUE!"},{"$error":"#VALUE!"},"","",{"$error":"#VALUE!"},{"$f":"SUM($H$20:$H358)","v":0}]
[{"$f":"IF(Values_Entered,A358+1,\"\")","v":""},"","","",{"$error":"#VALUE!"},{"$error":"#VALUE!"},"","",{"$error":"#VALUE!"},{"$f":"SUM($H$20:$H359)","v":0}]
[{"$f":"IF(Values_Entered,A359+1,\"\")","v":""},"","","",{"$error":"#VALUE!"},{"$error":"#VALUE!"},"","",{"$error":"#VALUE!"},{"$f":"SUM($H$20:$H360)","v":0}]
[{"$f":"IF(Values_Entered,A360+1,\"\")","v":""},"","","",{"$error":"#VALUE!"},{"$error":"#VALUE!"},"","",{"$error":"#VALUE!"},{"$f":"SUM($H$20:$H361)","v":0}]
[{"$f":"IF(Values_Entered,A361+1,\"\")","v":""},"","","",{"$error":"#VALUE!"},{"$error":"#VALUE!"},"","",{"$error":"#VALUE!"},{"$f":"SUM($H$20:$H362)","v":0}]
[{"$f":"IF(Values_Entered,A362+1,\"\")","v":""},"","","",{"$error":"#VALUE!"},{"$error":"#VALUE!"},"","",{"$error":"#VALUE!"},{"$f":"SUM($H$20:$H363)","v":0}]
[{"$f":"IF(Values_Entered,A363+1,\"\")","v":""},"","","",{"$error":"#VALUE!"},{"$error":"#VALUE!"},"","",{"$error":"#VALUE!"},{"$f":"SUM($H$20:$H364)","v":0}]
[{"$f":"IF(Values_Entered,A364+1,\"\")","v":""},"","","",{"$error":"#VALUE!"},{"$error":"#VALUE!"},"","",{"$error":"#VALUE!"},{"$f":"SUM($H$20:$H365)","v":0}]
[{"$f":"IF(Values_Entered,A365+1,\"\")","v":""},"","","",{"$error":"#VALUE!"},{"$error":"#VALUE!"},"","",{"$error":"#VALUE!"},{"$f":"SUM($H$20:$H366)","v":0}]
[{"$f":"IF(Values_Entered,A366+1,\"\")","v":""},"","","",{"$error":"#VALUE!"},{"$error":"#VALUE!"},"","",{"$error":"#VALUE!"},{"$f":"SUM($H$20:$H367)","v":0}]
[{"$f":"IF(Values_Entered,A367+1,\"\")","v":""},"","","",{"$error":"#VALUE!"},{"$error":"#VALUE!"},"","",{"$error":"#VALUE!"},{"$f":"SUM($H$20:$H368)","v":0}]
[{"$f":"IF(Values_Entered,A368+1,\"\")","v":""},"","","",{"$error":"#VALUE!"},{"$error":"#VALUE!"},"","",{"$error":"#VALUE!"},{"$f":"SUM($H$20:$H369)","v":0}]
[{"$f":"IF(Values_Entered,A369+1,\"\")","v":""},"","","",{"$error":"#VALUE!"},{"$error":"#VALUE!"},"","",{"$error":"#VALUE!"},{"$f":"SUM($H$20:$H370)","v":0}]
[{"$f":"IF(Values_Entered,A370+1,\"\")","v":""},"","","",{"$error":"#VALUE!"},{"$error":"#VALUE!"},"","",{"$error":"#VALUE!"},{"$f":"SUM($H$20:$H371)","v":0}]
[{"$f":"IF(Values_Entered,A371+1,\"\")","v":""},"","","",{"$error":"#VALUE!"},{"$error":"#VALUE!"},"","",{"$error":"#VALUE!"},{"$f":"SUM($H$20:$H372)","v":0}]
[{"$f":"IF(Values_Entered,A372+1,\"\")","v":""},"","","",{"$error":"#VALUE!"},{"$error":"#VALUE!"},"","",{"$error":"#VALUE!"},{"$f":"SUM($H$20:$H373)","v":0}]
[{"$f":"IF(Values_Entered,A373+1,\"\")","v":""},"","","",{"$error":"#VALUE!"},{"$error":"#VALUE!"},"","",{"$error":"#VALUE!"},{"$f":"SUM($H$20:$H374)","v":0}]
[{"$f":"IF(Values_Entered,A374+1,\"\")","v":""},"","","",{"$error":"#VALUE!"},{"$error":"#VALUE!"},"","",{"$error":"#VALUE!"},{"$f":"SUM($H$20:$H375)","v":0}]
[{"$f":"IF(Values_Entered,A375+1,\"\")","v":""},"","","",{"$error":"#VALUE!"},{"$error":"#VALUE!"},"","",{"$error":"#VALUE!"},{"$f":"SUM($H$20:$H376)","v":0}]
[{"$f":"IF(Values_Entered,A376+1,\"\")","v":""},"","","",{"$error":"#VALUE!"},{"$error":"#VALUE!"},"","",{"$error":"#VALUE!"},{"$f":"SUM($H$20:$H377)","v":0}]
[{"$f":"IF(Values_Entered,A377+1,\"\")","v":""},"","","",{"$error":"#VALUE!"},{"$error":"#VALUE!"},"","",{"$error":"#VALUE!"},{"$f":"SUM($H$20:$H378)","v":0}]
[{"$f":"IF(Values_Entered,A378+1,\"\")","v":""},"","","",{"$error":"#VALUE!"},{"$error":"#VALUE!"},"","",{"$error":"#VALUE!"},{"$f":"SUM($H$20:$H379)","v":0}]