{"text_format":"2","workbook":"xlsx","n_sheets":3,"sheets":["Table rentabilité optimisé","investissement réel","Remboursement Mensualités"],"not_rendered":{"charts":0,"images":1,"macros":0,"external_links":0,"defined_names":1,"comments":1,"pivot_tables":0},"unopened":[],"bounds":{"document_bytes":16777216,"sheet_cells":100000,"run_cost":"one","rows_first":2000,"rows_last":500,"rows_between":2000,"halvings":0,"cell_chars":16384,"cell_head_chars":4096},"cells_cut":0,"cells_raw":0,"read":"whole","date_system":"1900"}

{"sheet":"Table rentabilité optimisé","index":0,"n_rows":285,"n_cols":23,"rows_kept":285,"cut":false,"hidden":false,"merged":[[271,8,272,8],[274,8,275,8],[254,1,254,3],[254,4,254,7],[254,8,254,10],[14,8,15,8],[14,9,14,10],[14,12,15,12],[14,11,15,11],[14,13,14,15],[154,1,155,1],[154,2,154,4],[154,5,154,7],[14,3,15,3],[63,1,64,1],[65,1,66,1],[63,7,64,7],[65,7,66,7],[87,5,87,6],[14,2,15,2],[14,4,14,5],[117,2,117,3],[91,5,91,6],[100,5,100,6],[14,6,14,7]]}
[]
[null,"ETUDE RENTABILITE SOLUTIONS USAGE PRODUCTIF"]
[null,"Pôle multiservice paysans PMP"]
[]
[null,"Dimmensionnement optimisé "]
[null,"Dimmensionnement optimisé "]
[null,"Dimmensionnement réel"]
[null,"Cases à vérifier"]
[null,"Cases à compléter"]
[null,"Cases à laisser vides"]
[null,"Cases calculées"]
[]
[null,"Caractéristiques techniques du Projet"]
[]
[null,"Usage Productif","Selection","Nb applications","Capacité",null,"Puissance (kW)",null,"Prix (FCFA)","Production",null,"Energie consommée (KWh/j)","Energie à produire (kWh/j)","Fonctionnement optimal",null,null,"Coefficient déperdition (k)"]
[{"$nulls":4},"Quantité","Unité","Nominale","Absorbée",null,"Produit final","Tourteaux",null,null,"heures par jour pointe","heures par jour moyen","jours à l'année"]
[null,"Moulin à grains, 250 Kg/h","oui",1,250,"kg/h",4.6859999999999999,4.6859999999999999,1000000,1,0,{"$f":"H17*N17*D17","v":18.744},{"$f":"(H17*N17*D17)/Q17","v":26.777142857142859},4,4,300,0.7]
[null,"Moulin à grains, 125 Kg/h",null,null,300,"kg/h",2.2000000000000002,2.2000000000000002,700000]
[null,"Décortiqueuse électrique 150 Kg/h","oui",1,150,"kg/h",4.4000000000000004,4.4000000000000004,1000000,0.9,0.1,{"$f":"H19*N19*D19","v":17.600000000000001},{"$f":"(H19*N19*D19)/Q19","v":25.142857142857146},4,3,300,0.7]
[null,"Décortiqueuse électrique 75 Kg/h",null,null,150,"kg/h",2.2000000000000002,2.2000000000000002,700000]
[null,"Vibro-tamiseur 800 Kg/h","oui",1,800,"kg/h",0.4,0.4,1500000,"-","-",{"$f":"H21*N21*D21","v":2.4000000000000004},{"$f":"(H21*N21*D21)/Q21","v":3.4285714285714293},6,5,200,0.7]
[null,"Vibro-tamiseur 400 Kg/h",null,null,400,"kg/h",0.3,0.3,900000]
[null,"Congélateur 360L","non",1,200,"L/j",0.15,0.15,400000,"-","-",{"$f":"H23*N23*D23","v":3.5999999999999996},6,24,"-",300,0.6]
[null,"Téléviseur","non",1,"-","-",0.15,0.15,300000,"-","-",1.7999999999999998,3,12,8,300,0.6]
[null,"Banc de recharge de smartphone","oui",1,25,"téléphones/h",{"$f":"0.01*E25","v":0.25},{"$f":"G25","v":0.25},20000,"-","-",1,1.4285714285714286,4,5,300,0.7]
[null,"Pompe solaire (modèle Lorentz PS2-150 Boost-60)","non",2,1.3,"m3/h",0.3,0.3,1000000,"-","-",3,5,5,1,300,0.6]
[null,"Ordinateur","non",1,"-","-",0.1,0.1,500000,"-","-",{"$f":"H27*N27*D27","v":0},0,0,6,300,0.7]
[null,"Photocopieuse","non",1,"-","-",0.15,0.15,500000,"-","-",0.15,0.25,1,1,300,0.6]
[null,"Combiné bois menuisier","non",1,"-","-",1.5,1.5,2400000,"-","-",12,20,8,3,140,0.6]
[null,"Thermo-soudeur","non",1,"-","-",null,null,0,"-","-",0,{"$f":"(H30*N30*D30)/Q30","v":0},8,8,140,0.6]
[null,"Tisse sac","oui",1,"-","-",0.25,0.25,150000,{"$nulls":4},1,1,300,0.7]
[]
[null,"Éclairage","oui",3,"-","-",1.0999999999999999E-2,1.0999999999999999E-2,1500,"-","-",0.32999999999999996,0.47142857142857142,10,6,300,0.7]
[null,"Support aluminium","oui",{"$f":"C135","v":27},"-","-",null,null,35000]
[null,"Démarreur/variateur","oui",1,"-","-"]
[null,"Parafoudre ","oui",1,"-","-",null,null,140000]
[null,"Câbles et accessoires & installation int.","oui",1,"-","-",null,null,1000000]
[null,"Batiment","oui",1,"-","-",null,null,10000000]
[null,"Local batteries","oui",1,"-","-",null,null,1000000]
[null,"Installation","oui",1,"-","-",null,null,1000000]
[null,"Coffret DC"]
[null,"Coffret AC"]
[null,"Ensemble mise à la terre ",null,1,{"$nulls":4},161755]
[null,"Coffret pour batteries",null,1,{"$nulls":4},{"$f":"9112*F107","v":218688}]
[]
[]
[null,"Alimentation Solaire","Puissance (kW)","Prix (FCFA)","Coefficient déperdition","Tension (V)",null,"Batteries","Capacité (Ampères/h)","Prix (FCFA)","Tension (V)","Durée de vie*","* en conditions optimales, annoncées constructeur"]
[null,"Modules PV  (375 Wc) Polycristallin",0.375,78148,0.6,"24V",null,"Victron Energy Gel",220,400000,12,7]
[null,"BlueSolar SPM-300-24 Monocristallin",0.3,300000,0.6,"24V",null,"GEL HOPPECKE 6 OPzV 370",400,{"$f":"660*655","v":432300},6,10]
[null,"Tension nécessaire alimentation solaire",{"$f":"IF(J52<0.5,\"12V\",IF(AND(J52>=0.5,J52<2),\"24V\",IF(J52>=2,\"48V\")))","v":"48V"},{"$nulls":4},"Batteries OPZS 1220 (Ah)",1220,194400.625,2,12]
[{"$nulls":7},"Victron Energy Gel 2",265,580000,12,7]
[{"$nulls":7},"Tension nécessaire batteries",{"$f":"IF(J52<0.5,12,IF(AND(J52>=0.5,J52<2),24,IF(J52>=2,48)))","v":48},{"$f":"F104*INDEX(C:C,MATCH(F81,B:B,0))","v":10.125}]
[]
[null,"Onduleur chargeur ","kVa","Prix (FCFA)",null,null,null,"Regulateur/Onduleur reseau",null,"Prix (FCFA)","Tension (V)"]
[null,"Vitron Energy Phoenix",2,450000,null,null,null,"Onduleur reseau 20 KW",null,1870329,"12V/24V/48V"]
[null,"Convertisseur chargeur victron  8KVA",8,1660376,null,null,null,"Régulateur Victron Smart bluesolar MPPT 150V ; 85A",null,316410,"12V/24V/48V"]
[]
[null,"Irradiation Solaire"]
[null,"Month ","Jan ","Feb ","Mar ","Apr ","May ","Jun ","Jul ","Aug ","Sep ","Oct ","Nov ","Dec ","Year"]
[null,"H(15)*",5.12,5.75,6.37,6.61,6.34,6.05,6.26,5.51,6.03,5.81,5.226,5.03,{"$f":"IF('Table rentabilité optimisé'!G95=\"x\",MAX(C60:N60),IF('Table rentabilité optimisé'!G96=\"x\",MIN(C60:N60),IF('Table rentabilité optimisé'!G97=\"x\",AVERAGE(C60:N60),\"erreur\")))","v":5.8421666666666674}]
[]
[null,"Électricité du réseau"]
[null,"Frais variables d'utilisation du réseau",null,"1ère Tranche","2ème Tranche","3ème Tranche",null,null,null,"1ère Tranche","2ème Tranche","3ème Tranche","Total"]
[null,"UP-Petite Puissance","Tranche (KWh)",50,500,"∞",null,"UP-Petite Puissance","Energie par Tranche",{"$f":"(F100*30)-SUM(K64:L64)","v":50},{"$f":"IF((F100*30)>D64,(F100*30)-D64-L64,0)","v":450},{"$f":"IF((F100*30)>E64,(F100*30)-E64,0)","v":702.22},{"$f":"SUM(J64:L64)","v":1202.22}]
[null,null,"Prix (KWh)",128.85,135.68,147.68,null,null,"Coût (FCFA)",{"$f":"J64*D65","v":6442.5},{"$f":"K64*E65","v":61056},{"$f":"L64*F65","v":103703.84960000002},{"$f":"SUM(J65:L65)","v":171202.34960000002}]
[null,"UP-Moyenne Puissance","Tranche",100,500,"∞",null,"UP-Moyenne Puissance","Energie par Tranche",{"$f":"(F100*30)-SUM(K66:L66)","v":100},{"$f":"IF((F100*30)>D66,(F100*30)-D66-L66,0)","v":400},{"$f":"IF((F100*30)>E66,(F100*30)-E66,0)","v":702.22},{"$f":"SUM(J66:L66)","v":1202.22}]
[null,null,"Prix (KWh)",129.81,136.53,149.24,null,null,"Coût (FCFA)",{"$f":"J66*D67","v":12981},{"$f":"K66*E67","v":54612},{"$f":"L66*F67","v":104799.31280000001},{"$f":"SUM(J67:L67)","v":172392.31280000001}]
[]
[null,"Frais fixes de raccordement","Fixe/Distance","Prix TTC","Étude raccordement"]
[null,"Réseau HTA","Kg câble","10.000 à 100.000",550000]
[null,"Réseau HTA - Autres Frais","Fixe","2.000.000 à 7.000.000",550000]
[null,"Transformateur HT/MT - BT","Fixe",4800000,179000]
[null,"Extension BT*","Distance",8260,179000]
[null,"Dépend également de la distance de transport des équipements et nombre et type de poteaux non mesurable sauf par Sénélec (approximation)"]
[]
[]
[null,"Choix de dimensionnement du projet"]
[]
[null,"Commandes annuelles totales de mil",{"$nulls":4},"Tonnes"]
[]
[null,"Choix de l'alimentation solaire",null,null,null,"Modules PV  (375 Wc) Polycristallin"]
[null,"Choix du système de stokage",null,null,null,"Batteries OPZS 1220 (Ah)"]
[null,"Choix de l'onduleur reseau ",null,null,null,"Onduleur reseau 20 KW"]
[null,"Choix de l'onduleur chargeur ",null,null,null,"Convertisseur chargeur victron  8KVA"]
[null,"Choix de la decortiqueuse",null,null,null,"Décortiqueuse électrique 150 Kg/h"]
[null,"Choix du moulin",null,null,null,"Moulin à grains, 250 Kg/h"]
[null,"Choix du vibro tamisseur",null,null,null,"Vibro-tamiseur 800 Kg/h"]
[null,"Equivalent Réseau",null,null,null,{"$f":"IF(M65<M67,B64,B66)","v":"UP-Petite Puissance"}]
[null,"Raccordement nécessaire (MT, BT) et distance",null,null,null,"MT",600]
[null,"Montant Frais HTA et KG câble",null,null,null,4462549,33]
[]
[null,"Autonomie nécessaires au projet (jours)",null,null,null,0.9]
[null,"Profondeur décharge batteries",null,null,null,0.7]
[]
[null,"Choix du cas pour dimensionnement solaire",null,null,null,"best case"]
[{"$nulls":5},"worst case"]
[{"$nulls":5},"average","x"]
[]
[null,"Puissance Equipements ",null,null,null,{"$f":"(G17+G19+G21+G23+G25+G33)*1.2","v":11.8764},"KW"]
[null,"Energie journalière consommée (KWh)",null,null,null,{"$f":"SUMIF(C17:C33,\"oui\",L17:L33)","v":40.073999999999998},"KWh"]
[null,"Puissance crête projet (KW)",null,null,null,{"$f":"SUMIF(C17:C33,\"oui\",M17:M33)/O60","v":9.7992020246891443}]
[null,"Capacité totale système stockage (Ampères/heure)",null,null,null,{"$f":"SUMIF(C17:C33,\"oui\",L17:L33)*1000*(F92)/(F93*I52)","v":1073.4107142857144}]
[]
[null,"Nb de panneaux solaires",null,null,null,{"$f":"ROUNDUP(F101/INDEX(C:C,MATCH(F81,B:B,0)),0)","v":27},"unités"]
[null,"Nb de batteries en série",null,null,null,{"$f":"ROUNDUP(I52/INDEX(K:K,MATCH(F82,H:H,0)),0)","v":24},"unités"]
[null,"Nb de batteries en dérivation",null,null,null,{"$f":"ROUNDUP(F102/INDEX(I:I,MATCH(F82,H:H,0)),0)","v":1},"unités"]
[null,"Nb de batteries total",null,null,null,{"$f":"F105*F106","v":24},"unités"]
[null,"Durée de vie attendue de la batterie",null,null,null,{"$f":"INDEX(L:L,MATCH(F82,H:H,0))*(130%-F93)","v":7.2000000000000011},"ans"]
[null,"Convertisseur chargeur victron  8KVA",null,null,null,{"$f":"ROUNDUP(F99/INDEX(C:C,MATCH(F84,B:B,0)),0)","v":2},"unités"]
[null,"Nbre regulateur ",null,null,null,{"$f":"IF(OR(C50=24,C50=12),1,2)","v":2},"unités"]
[null,"Nb régulateurs",{"$nulls":4},"unités"]
[]
[null,"Employés nécessaires pour fonctionnement",null,null,null,4,"personnes"]
[]
[null,"Calcul de charges variables et fixes"]
[]
[null,"CHARGES VARIABLES D'EXPLOITATION"]
[null,"Désignation","Quantité",null,"Prix unitaire","Montant total/an",null,"évolution annuelle charges d'exploitation",null,null,0.03]
[null,"Achat mil tamisé paysan",{"$f":"F79*1000","v":0},"Kilos",180,{"$f":"E119*C119","v":0}]
[null,"Cout de mise en sac",{"$f":"C119","v":0},"Kilos",5,{"$f":"E120*C120","v":0},null,"Avantage coût électricité PV vs. Réseau",null,"Sur 1 an",{"$f":"((MIN(M67,M65)*12)+IF(F89=\"MT\",(G89*D73)+D72+E70+F90,(G89*D73)))-(SUM(F135:F144,F149)+SUM(G135:G144,G149))","v":2700336.0952000003}]
{"$rows_left_out":166}
{"sheet":"investissement réel","index":1,"n_rows":25,"n_cols":6,"rows_kept":25,"cut":false,"hidden":false,"merged":[]}
[]
[]
["Désignation ","Quantité","Prix unitaire TTC","Durée de vie (an)","Montant Total TTC","Amortissement annuel"]
["Moulin à grains",1,1000000,15,{"$f":"B4*C4","v":1000000},{"$f":"E4/D4","v":66666.666666666672}]
["Congélateur 360L",1,400000,7,{"$f":"B5*C5","v":400000},{"$f":"E5/D5","v":57142.857142857145}]
["Banc de recharge de smartphone",1,20000,10,20000,{"$f":"E6/D6","v":2000}]
["Décortiqueuse électrique",1,1000000,15,1000000,66666.666666666672]
["Vibro-tamiseur",1,1300000,15,{"$f":"B8*C8","v":1300000},86666.666666666672]
["Éclairage",3,1500,2,4500,2250]
["Modules PV  (375 Wc)",54,78148.148148148102,20,{"$f":"B10*C10","v":4219999.9999999972},210999.99999999985]
["Onduleur reseau 20 KW",1,1870329,10,1870329,187032.9]
["Batteries OPZS 1220 (Ah)",48,194400.625,7,9331230,1333032.857142857]
["Convertisseur chargeur victron  8KVA",3,1660376,10,{"$f":"B13*C13","v":4981128},498112.8]
["Coffret DC",1,275563,15,275563,18370.866666666665]
["Coffret AC",1,1049763,15,1049763,69984.2]
["Câbles et accessoires ",1,583632,20,583632,29181.599999999999]
["Ensemble mise à la terre et accessoires",1,161755,10,161755,16175.5]
["Coffret pour batteries",1,437401,7,437401,62485.857142857145]
["Batiment",1,10000000,30,10000000,333333.33333333331]
["Local batteries",1,1149167,30,1149167,38305.566666666666]
["Installation",1,1370600,30,1370600,45686.666666666664]
["Support aluminium",14,82500,20,{"$f":"B22*C22","v":1155000},{"$f":"IFERROR(E22/D22,0)","v":57750}]
["Démarreur/variateur",1,925000,15,925000,61666.666666666664]
["Parafoudre ",1,140000,15,140000,9333.3333333333339]
[" TOTAL (F CFA) ",null,null,null,{"$f":"SUM(E4:E24)","v":41375068},2737297.6190476194]

{"sheet":"Remboursement Mensualités","index":2,"n_rows":133,"n_cols":7,"rows_kept":133,"cut":false,"hidden":true,"merged":[]}
["Remboursement de prêt"]
["Taux annuel",{"$f":"'Table rentabilité optimisé'!D189","v":0.15}]
["Capital emprunté",{"$f":"'Table rentabilité optimisé'!D188","v":24064000}]
["Durée du prêt (en année)",{"$f":"'Table rentabilité optimisé'!D190","v":7},{"$f":"B4*12","v":84}]
["Mensualité à régler",{"$f":"-PMT((1+B2)^(1/12)-1,B4*12,B3)","v":451729.67920513818},"Formule mensualité","=-VPM((1+B2)^(1/12)-1;B4*12;B3)"]
[]
["Décomposition de la mensualité"]
["Remboursement du principal",{"$f":"-PPMT((1+B2)^(1/12)-1,1,B4*12,B3)","v":169821.9184457864},"Formule principal","=-PRINCPER((1+B2)^(1/12)-1;1;B4*12;B3)"]
["Remboursement des interêts",{"$f":"-IPMT((1+B2)^(1/12)-1,1,B4*12,B3)","v":281907.76075935172},"Formule intérêt","=-INTPER((1+B2)^(1/12)-1;1;B4*12;B3)"]
[]
[]
["Dans les formules ci-dessous Taux de période = TP =  (1+$B$2)^(1/12)-1"]
["Périodes","Mensualité","Capital","Intérêts","Reste (ou résiduel)","Années"]
[{"$f":"IF(B4<>0,1,\"-\")","v":1},{"$f":"IF(A14<>\"-\",C14+D14,\"\")","v":451729.67920513812},{"$f":"IF(A14<>\"-\",-PPMT((1+$B$2)^(1/12)-1,A14,$B$4*12,$B$3),\"\")","v":169821.9184457864},{"$f":"IF(A14<>\"-\",-IPMT((1+$B$2)^(1/12)-1,A14,$B$4*12,$B$3),\"\")","v":281907.76075935172},{"$f":"IF(A14<>\"-\",$B$3+CUMPRINC((1+$B$2)^(1/12)-1,$B$4*12,$B$3,1,A14,0),\"\")","v":23894178.081554215},{"$f":"IF(A14<>\"-\",1,\"\")","v":1},{"$f":"IF(A14<>\"-\",1,\"\")","v":1}]
[{"$f":"IF(AND($B$4<>0,A14<$C$4),A14+1,\"-\")","v":2},{"$f":"IF(A15<>\"-\",C15+D15,\"\")","v":451729.67920513818},{"$f":"IF(A15<>\"-\",-PPMT((1+$B$2)^(1/12)-1,A15,$B$4*12,$B$3),\"\")","v":171811.36811154895},{"$f":"IF(A15<>\"-\",-IPMT((1+$B$2)^(1/12)-1,A15,$B$4*12,$B$3),\"\")","v":279918.31109358923},{"$f":"IF(A15<>\"-\",$B$3+CUMPRINC((1+$B$2)^(1/12)-1,$B$4*12,$B$3,1,A15,0),\"\")","v":23722366.713442665},{"$f":"IF(A15<>\"-\",IF(G14<G15,F14,F14+1),\"\")","v":1},{"$f":"IF(A15=\"-\",\"\",IF(G14<12,G14+1,1))","v":2}]
[{"$f":"IF(AND($B$4<>0,A15<$C$4),A15+1,\"-\")","v":3},451729.67920513818,173824.12401486206,277905.55519027612,23548542.589427803,{"$f":"IF(A16<>\"-\",IF(G15<G16,F15,F15+1),\"\")","v":1},{"$f":"IF(A16=\"-\",\"\",IF(G15<12,G15+1,1))","v":3}]
[4,451729.67920513812,175860.45918636245,275869.22001877567,23372682.130241439,1,4]
[5,451729.67920513824,177920.64985521795,273809.02934992028,23194761.480386224,1,5]
[6,451729.67920513818,180004.97548659815,271724.70371854003,23014756.504899625,1,6]
[7,451729.67920513824,182113.71881958391,269615.9603855543,22832642.78608004,1,7]
[8,451729.67920513824,184247.16590552087,267482.51329961733,22648395.62017452,1,8]
[9,451729.67920513824,186405.60614682251,265324.07305831573,22461990.014027696,1,9]
[10,451729.67920513812,188589.33233622744,263140.34686891071,22273400.681691468,1,10]
[11,451729.67920513812,190798.64069651693,260931.03850862122,22082602.040994953,1,11]
[12,451729.67920513824,193033.8309206976,258695.84828444061,21889568.210074253,1,12]
[13,451729.67920513818,195295.20621265459,256434.47299248358,21694273.003861599,2,1]
[14,451729.67920513812,197583.07332828143,254146.60587685669,21496689.93053332,2,2]
[15,451729.67920513818,199897.74261709157,251831.93658804661,21296792.187916227,2,3]
[16,451729.67920513824,202239.52806431707,249490.15114082114,21094552.659851909,2,4]
[17,451729.67920513818,204608.74733350088,247120.93187163729,20889943.912518408,2,5]
[18,451729.67920513824,207005.72180958814,244723.95739555007,20682938.19070882,2,6]
[19,451729.67920513812,209430.77664252173,242298.90256261639,20473507.4140663,2,7]
[20,451729.67920513818,211884.24079134924,239845.43841378894,20261623.173274949,2,8]
[21,451729.67920513818,214366.44706884612,237363.23213629206,20047256.726206101,2,9]
[22,451729.67920513824,216877.7321866618,234851.94701847641,19830378.994019441,2,10]
[23,451729.67920513818,219418.43680099474,232311.24240414344,19610960.557218447,2,11]
[24,451729.67920513824,221988.90555880248,229740.77364633573,19388971.651659645,2,12]
[25,451729.67920513824,224589.48714455304,227140.19206058516,19164382.164515093,3,1]
[26,451729.67920513824,227220.53432752399,224509.14487761425,18937161.630187567,3,2]
[27,451729.67920513818,229882.40400965564,221847.27519548254,18707279.226177912,3,3]
[28,451729.67920513824,232575.45727396489,219154.22193117332,18474703.768903948,3,4]
[29,451729.67920513812,235300.05943352627,216429.61977161188,18239403.709470421,3,5]
[30,451729.67920513824,238056.58008102665,213673.09912411161,18001347.129389394,3,6]
[31,451729.67920513812,240845.39313890025,210884.28606623787,17760501.736250494,3,7]
[32,451729.67920513824,243666.87691005191,208062.80229508629,17516834.85934044,3,8]
[33,451729.67920513812,246521.41412917327,205208.26507596488,17270313.445211269,3,9]
[34,451729.67920513824,249409.39201466134,202320.28719047687,17020904.053196609,3,10]
[35,451729.67920513818,252331.2023211442,199398.47688399398,16768572.850875463,3,11]
[36,451729.67920513818,255287.24139262314,196442.43781251504,16513285.60948284,3,12]
[37,451729.67920513824,258277.91021623634,193451.76898890187,16255007.699266601,4,1]
[38,451729.67920513824,261303.61447665287,190426.06472848533,15993704.08478995,4,2]
[39,451729.67920513824,264364.76461110427,187364.91459403397,15729339.320178846,4,3]
[40,451729.67920513818,267461.77586505993,184267.90334007825,15461877.544313785,4,4]
[41,451729.67920513812,270595.06834855553,181134.61085658261,15191282.475965232,4,5]
[42,451729.67920513824,273765.06709318096,177964.61211195725,14917517.408872049,4,6]
[43,451729.67920513824,276972.20210973563,174757.47709540257,14640545.206762316,4,7]
[44,451729.67920513818,280216.90844656003,171512.77075857815,14360328.298315754,4,8]
[45,451729.67920513824,283499.62624854961,168230.0529565886,14076828.672067206,4,9]
[46,451729.67920513818,286820.80081686086,164908.87838827731,13790007.871250343,4,10]
[47,451729.67920513818,290180.8826693162,161548.79653582198,13499826.988581028,4,11]
[48,451729.67920513824,293580.32760151697,158149.35160362124,13206246.660979513,4,12]
[49,451729.67920513812,297019.59674867202,154710.0824564661,12909227.064230839,5,1]
[50,451729.67920513818,300499.15664815111,151230.52255698707,12608727.907582685,5,2]
[51,451729.67920513818,304019.47930277023,147710.19990236795,12304708.428279916,5,3]
[52,451729.67920513824,307581.04224481928,144148.63696031892,11997127.3860351,5,4]
[53,451729.67920513824,311184.32860083925,140545.35060429896,11685943.057434257,5,5]
[54,451729.67920513818,314829.8271571584,136899.85204797977,11371113.230277102,5,6]
[55,451729.67920513818,318518.03242619633,133211.64677894185,11052595.197850902,5,7]
[56,451729.67920513818,322249.44471354439,129480.2344915938,10730345.753137361,5,8]
[57,451729.67920513812,326024.57018583239,125705.10901930573,10404321.182951527,5,9]
[58,451729.67920513818,329843.92093939037,121885.75826574782,10074477.262012137,5,10]
[59,451729.67920513824,333708.01506971405,118021.66413542417,9740769.2469424214,5,11]
[60,451729.67920513824,337617.37674174493,114112.30246339331,9403151.870200675,5,12]
[61,451729.67920513824,341572.53626097331,110157.14294416491,9061579.3339397013,6,1]
[62,451729.67920513818,345574.03014537418,106155.64905976401,8716005.3037943281,6,2]
[63,451729.67920513818,349622.40119818615,102107.27800695204,8366382.902596144,6,3]
[64,451729.67920513824,353718.19858154259,98011.480623595649,8012664.7040146012,6,4]
[65,451729.67920513812,357861.97789096547,93867.701314172664,7654802.7261236366,6,5]
[66,{"$f":"IF(A79<>\"-\",C79+D79,\"\")","v":451729.67920513818},{"$f":"IF(A79<>\"-\",-PPMT((1+$B$2)^(1/12)-1,A79,$B$4*12,$B$3),\"\")","v":362054.30123073258},{"$f":"IF(A79<>\"-\",-IPMT((1+$B$2)^(1/12)-1,A79,$B$4*12,$B$3),\"\")","v":89675.377974405594},{"$f":"IF(A79<>\"-\",$B$3+CUMPRINC((1+$B$2)^(1/12)-1,$B$4*12,$B$3,1,A79,0),\"\")","v":7292748.4248929061},6,6]
[{"$f":"IF(AND($B$4<>0,A79<$C$4),A79+1,\"-\")","v":67},451729.67920513824,366295.73729012621,85433.941915011994,6926452.687602777,{"$f":"IF(A80<>\"-\",IF(G79<G80,F79,F79+1),\"\")","v":6},{"$f":"IF(A80=\"-\",\"\",IF(G79<12,G79+1,1))","v":7}]
[68,451729.67920513824,370586.86142057652,81142.817784561717,6555865.8261822015,6,8]
[69,451729.67920513818,374928.25571370771,76801.423491430454,6180937.5704684928,6,9]
[70,451729.67920513818,379320.50908029935,72409.170124838827,5801617.0613881946,6,10]
[71,451729.67920513818,383764.21733017155,67965.461874966626,5417852.8440580219,6,11]
[72,451729.67920513818,388259.98325300706,63469.695952131107,5029592.860805016,6,12]
[73,451729.67920513812,392808.41670011968,58921.262505018458,4636784.4441048913,7,1]
[74,451729.67920513824,397410.13466718083,54319.544537957416,4239374.3094377145,7,2]
[75,451729.67920513812,402065.76137791446,49663.917827223653,3837308.5480598025,7,3]
[76,451729.67920513812,406775.92836877436,44953.75083636379,3430532.6196910255,7,4]
[77,451729.67920513818,411541.27457461081,40188.404630527373,3018991.3451164141,7,5]
[78,451729.67920513812,416362.44641534291,35367.232789795235,2602628.8987010755,7,6]
[79,451729.67920513824,421240.09788364562,30489.581321492587,2181388.80081743,7,7]
[80,451729.67920513818,426174.8906336634,25554.788571474779,1755213.9101837575,7,8]
[81,451729.67920513824,431167.4940707644,20562.185134373809,1324046.4161130004,7,9]
[82,451729.67920513812,436218.58544234472,15511.093762793425,887827.83067065477,7,10]
[83,451729.67920513818,441328.84992969781,10400.829275440394,446498.98074095696,7,11]
[84,451729.67920513818,446498.98074095865,5230.6984641795461,-3.7252902984619141E-9,7,12]
["-","","","","","",""]
["-","","","","","",""]
["-","","","","","",""]
["-","","","","","",""]
["-","","","","","",""]
["-","","","","","",""]
["-","","","","","",""]
["-","","","","","",""]
["-","","","","","",""]
["-","","","","","",""]
["-","","","","","",""]
["-","","","","","",""]
["-","","","","","",""]
["-","","","","","",""]
["-","","","","","",""]
["-","","","","","",""]
["-","","","","","",""]
["-","","","","","",""]
["-","","","","","",""]
["-","","","","","",""]
["-","","","","","",""]
["-","","","","","",""]
["-","","","","","",""]
{"$rows_left_out":13}