{"text_format":"2","workbook":"xlsx","n_sheets":3,"sheets":["Table rentabilité optimisé","investissement réel","Remboursement Mensualités"],"not_rendered":{"charts":0,"images":1,"macros":0,"external_links":0,"defined_names":1,"comments":1,"pivot_tables":0},"unopened":[],"bounds":{"document_bytes":16777216,"sheet_cells":100000,"run_cost":"one","rows_first":2000,"rows_last":500,"rows_between":2000,"halvings":0,"cell_chars":16384,"cell_head_chars":4096},"cells_cut":0,"cells_raw":0,"read":"whole","date_system":"1900"}

{"sheet":"Table rentabilité optimisé","index":0,"n_rows":285,"n_cols":23,"rows_kept":285,"cut":false,"hidden":false,"merged":[[271,8,272,8],[274,8,275,8],[254,1,254,3],[254,4,254,7],[254,8,254,10],[14,8,15,8],[14,9,14,10],[14,12,15,12],[14,11,15,11],[14,13,14,15],[154,1,155,1],[154,2,154,4],[154,5,154,7],[14,3,15,3],[63,1,64,1],[65,1,66,1],[63,7,64,7],[65,7,66,7],[87,5,87,6],[14,2,15,2],[14,4,14,5],[117,2,117,3],[91,5,91,6],[100,5,100,6],[14,6,14,7]]}
[]
[null,"ETUDE RENTABILITE SOLUTIONS USAGE PRODUCTIF"]
[null,"Pôle multiservice paysans PMP"]
[]
[null,"Dimmensionnement optimisé "]
[null,"Dimmensionnement optimisé "]
[null,"Dimmensionnement réel"]
[null,"Cases à vérifier"]
[null,"Cases à compléter"]
[null,"Cases à laisser vides"]
[null,"Cases calculées"]
[]
[null,"Caractéristiques techniques du Projet"]
[]
[null,"Usage Productif","Selection","Nb applications","Capacité",null,"Puissance (kW)",null,"Prix (FCFA)","Production",null,"Energie consommée (KWh/j)","Energie à produire (kWh/j)","Fonctionnement optimal",null,null,"Coefficient déperdition (k)"]
[{"$nulls":4},"Quantité","Unité","Nominale","Absorbée",null,"Produit final","Tourteaux",null,null,"heures par jour pointe","heures par jour moyen","jours à l'année"]
[null,"Moulin à grains, 250 Kg/h","oui",1,250,"kg/h",4.6859999999999999,4.6859999999999999,1000000,1,0,{"$f":"H17*N17*D17","v":18.744},{"$f":"(H17*N17*D17)/Q17","v":26.777142857142859},4,4,300,0.7]
[null,"Moulin à grains, 125 Kg/h",null,null,300,"kg/h",2.2000000000000002,2.2000000000000002,700000]
[null,"Décortiqueuse électrique 150 Kg/h","oui",1,150,"kg/h",4.4000000000000004,4.4000000000000004,1000000,0.9,0.1,{"$f":"H19*N19*D19","v":17.600000000000001},{"$f":"(H19*N19*D19)/Q19","v":25.142857142857146},4,3,300,0.7]
[null,"Décortiqueuse électrique 75 Kg/h",null,null,150,"kg/h",2.2000000000000002,2.2000000000000002,700000]
[null,"Vibro-tamiseur 800 Kg/h","oui",1,800,"kg/h",0.4,0.4,1500000,"-","-",{"$f":"H21*N21*D21","v":2.4000000000000004},{"$f":"(H21*N21*D21)/Q21","v":3.4285714285714293},6,5,200,0.7]
[null,"Vibro-tamiseur 400 Kg/h",null,null,400,"kg/h",0.3,0.3,900000]
[null,"Congélateur 360L","non",1,200,"L/j",0.15,0.15,400000,"-","-",{"$f":"H23*N23*D23","v":3.5999999999999996},6,24,"-",300,0.6]
[null,"Téléviseur","non",1,"-","-",0.15,0.15,300000,"-","-",1.7999999999999998,3,12,8,300,0.6]
[null,"Banc de recharge de smartphone","oui",1,25,"téléphones/h",{"$f":"0.01*E25","v":0.25},{"$f":"G25","v":0.25},20000,"-","-",1,1.4285714285714286,4,5,300,0.7]
[null,"Pompe solaire (modèle Lorentz PS2-150 Boost-60)","non",2,1.3,"m3/h",0.3,0.3,1000000,"-","-",3,5,5,1,300,0.6]
[null,"Ordinateur","non",1,"-","-",0.1,0.1,500000,"-","-",{"$f":"H27*N27*D27","v":0},0,0,6,300,0.7]
[null,"Photocopieuse","non",1,"-","-",0.15,0.15,500000,"-","-",0.15,0.25,1,1,300,0.6]
[null,"Combiné bois menuisier","non",1,"-","-",1.5,1.5,2400000,"-","-",12,20,8,3,140,0.6]
[null,"Thermo-soudeur","non",1,"-","-",null,null,0,"-","-",0,{"$f":"(H30*N30*D30)/Q30","v":0},8,8,140,0.6]
[null,"Tisse sac","oui",1,"-","-",0.25,0.25,150000,{"$nulls":4},1,1,300,0.7]
[]
[null,"Éclairage","oui",3,"-","-",1.0999999999999999E-2,1.0999999999999999E-2,1500,"-","-",0.32999999999999996,0.47142857142857142,10,6,300,0.7]
[null,"Support aluminium","oui",{"$f":"C135","v":27},"-","-",null,null,35000]
[null,"Démarreur/variateur","oui",1,"-","-"]
[null,"Parafoudre ","oui",1,"-","-",null,null,140000]
[null,"Câbles et accessoires & installation int.","oui",1,"-","-",null,null,1000000]
[null,"Batiment","oui",1,"-","-",null,null,10000000]
[null,"Local batteries","oui",1,"-","-",null,null,1000000]
[null,"Installation","oui",1,"-","-",null,null,1000000]
[null,"Coffret DC"]
[null,"Coffret AC"]
[null,"Ensemble mise à la terre ",null,1,{"$nulls":4},161755]
[null,"Coffret pour batteries",null,1,{"$nulls":4},{"$f":"9112*F107","v":218688}]
[]
[]
[null,"Alimentation Solaire","Puissance (kW)","Prix (FCFA)","Coefficient déperdition","Tension (V)",null,"Batteries","Capacité (Ampères/h)","Prix (FCFA)","Tension (V)","Durée de vie*","* en conditions optimales, annoncées constructeur"]
[null,"Modules PV  (375 Wc) Polycristallin",0.375,78148,0.6,"24V",null,"Victron Energy Gel",220,400000,12,7]
[null,"BlueSolar SPM-300-24 Monocristallin",0.3,300000,0.6,"24V",null,"GEL HOPPECKE 6 OPzV 370",400,{"$f":"660*655","v":432300},6,10]
[null,"Tension nécessaire alimentation solaire",{"$f":"IF(J52<0.5,\"12V\",IF(AND(J52>=0.5,J52<2),\"24V\",IF(J52>=2,\"48V\")))","v":"48V"},{"$nulls":4},"Batteries OPZS 1220 (Ah)",1220,194400.625,2,12]
[{"$nulls":7},"Victron Energy Gel 2",265,580000,12,7]
[{"$nulls":7},"Tension nécessaire batteries",{"$f":"IF(J52<0.5,12,IF(AND(J52>=0.5,J52<2),24,IF(J52>=2,48)))","v":48},{"$f":"F104*INDEX(C:C,MATCH(F81,B:B,0))","v":10.125}]
[]
[null,"Onduleur chargeur ","kVa","Prix (FCFA)",null,null,null,"Regulateur/Onduleur reseau",null,"Prix (FCFA)","Tension (V)"]
[null,"Vitron Energy Phoenix",2,450000,null,null,null,"Onduleur reseau 20 KW",null,1870329,"12V/24V/48V"]
[null,"Convertisseur chargeur victron  8KVA",8,1660376,null,null,null,"Régulateur Victron Smart bluesolar MPPT 150V ; 85A",null,316410,"12V/24V/48V"]
[]
[null,"Irradiation Solaire"]
[null,"Month ","Jan ","Feb ","Mar ","Apr ","May ","Jun ","Jul ","Aug ","Sep ","Oct ","Nov ","Dec ","Year"]
[null,"H(15)*",5.12,5.75,6.37,6.61,6.34,6.05,6.26,5.51,6.03,5.81,5.226,5.03,{"$f":"IF('Table rentabilité optimisé'!G95=\"x\",MAX(C60:N60),IF('Table rentabilité optimisé'!G96=\"x\",MIN(C60:N60),IF('Table rentabilité optimisé'!G97=\"x\",AVERAGE(C60:N60),\"erreur\")))","v":5.8421666666666674}]
[]
[null,"Électricité du réseau"]
[null,"Frais variables d'utilisation du réseau",null,"1ère Tranche","2ème Tranche","3ème Tranche",null,null,null,"1ère Tranche","2ème Tranche","3ème Tranche","Total"]
[null,"UP-Petite Puissance","Tranche (KWh)",50,500,"∞",null,"UP-Petite Puissance","Energie par Tranche",{"$f":"(F100*30)-SUM(K64:L64)","v":50},{"$f":"IF((F100*30)>D64,(F100*30)-D64-L64,0)","v":450},{"$f":"IF((F100*30)>E64,(F100*30)-E64,0)","v":702.22},{"$f":"SUM(J64:L64)","v":1202.22}]
[null,null,"Prix (KWh)",128.85,135.68,147.68,null,null,"Coût (FCFA)",{"$f":"J64*D65","v":6442.5},{"$f":"K64*E65","v":61056},{"$f":"L64*F65","v":103703.84960000002},{"$f":"SUM(J65:L65)","v":171202.34960000002}]
[null,"UP-Moyenne Puissance","Tranche",100,500,"∞",null,"UP-Moyenne Puissance","Energie par Tranche",{"$f":"(F100*30)-SUM(K66:L66)","v":100},{"$f":"IF((F100*30)>D66,(F100*30)-D66-L66,0)","v":400},{"$f":"IF((F100*30)>E66,(F100*30)-E66,0)","v":702.22},{"$f":"SUM(J66:L66)","v":1202.22}]
[null,null,"Prix (KWh)",129.81,136.53,149.24,null,null,"Coût (FCFA)",{"$f":"J66*D67","v":12981},{"$f":"K66*E67","v":54612},{"$f":"L66*F67","v":104799.31280000001},{"$f":"SUM(J67:L67)","v":172392.31280000001}]
[]
[null,"Frais fixes de raccordement","Fixe/Distance","Prix TTC","Étude raccordement"]
[null,"Réseau HTA","Kg câble","10.000 à 100.000",550000]
[null,"Réseau HTA - Autres Frais","Fixe","2.000.000 à 7.000.000",550000]
[null,"Transformateur HT/MT - BT","Fixe",4800000,179000]
[null,"Extension BT*","Distance",8260,179000]
[null,"Dépend également de la distance de transport des équipements et nombre et type de poteaux non mesurable sauf par Sénélec (approximation)"]
[]
[]
[null,"Choix de dimensionnement du projet"]
[]
[null,"Commandes annuelles totales de mil",{"$nulls":4},"Tonnes"]
[]
[null,"Choix de l'alimentation solaire",null,null,null,"Modules PV  (375 Wc) Polycristallin"]
[null,"Choix du système de stokage",null,null,null,"Batteries OPZS 1220 (Ah)"]
[null,"Choix de l'onduleur reseau ",null,null,null,"Onduleur reseau 20 KW"]
[null,"Choix de l'onduleur chargeur ",null,null,null,"Convertisseur chargeur victron  8KVA"]
[null,"Choix de la decortiqueuse",null,null,null,"Décortiqueuse électrique 150 Kg/h"]
[null,"Choix du moulin",null,null,null,"Moulin à grains, 250 Kg/h"]
[null,"Choix du vibro tamisseur",null,null,null,"Vibro-tamiseur 800 Kg/h"]
[null,"Equivalent Réseau",null,null,null,{"$f":"IF(M65<M67,B64,B66)","v":"UP-Petite Puissance"}]
[null,"Raccordement nécessaire (MT, BT) et distance",null,null,null,"MT",600]
[null,"Montant Frais HTA et KG câble",null,null,null,4462549,33]
[]
[null,"Autonomie nécessaires au projet (jours)",null,null,null,0.9]
[null,"Profondeur décharge batteries",null,null,null,0.7]
[]
[null,"Choix du cas pour dimensionnement solaire",null,null,null,"best case"]
[{"$nulls":5},"worst case"]
[{"$nulls":5},"average","x"]
[]
[null,"Puissance Equipements ",null,null,null,{"$f":"(G17+G19+G21+G23+G25+G33)*1.2","v":11.8764},"KW"]
[null,"Energie journalière consommée (KWh)",null,null,null,{"$f":"SUMIF(C17:C33,\"oui\",L17:L33)","v":40.073999999999998},"KWh"]
[null,"Puissance crête projet (KW)",null,null,null,{"$f":"SUMIF(C17:C33,\"oui\",M17:M33)/O60","v":9.7992020246891443}]
[null,"Capacité totale système stockage (Ampères/heure)",null,null,null,{"$f":"SUMIF(C17:C33,\"oui\",L17:L33)*1000*(F92)/(F93*I52)","v":1073.4107142857144}]
[]
[null,"Nb de panneaux solaires",null,null,null,{"$f":"ROUNDUP(F101/INDEX(C:C,MATCH(F81,B:B,0)),0)","v":27},"unités"]
[null,"Nb de batteries en série",null,null,null,{"$f":"ROUNDUP(I52/INDEX(K:K,MATCH(F82,H:H,0)),0)","v":24},"unités"]
[null,"Nb de batteries en dérivation",null,null,null,{"$f":"ROUNDUP(F102/INDEX(I:I,MATCH(F82,H:H,0)),0)","v":1},"unités"]
[null,"Nb de batteries total",null,null,null,{"$f":"F105*F106","v":24},"unités"]
[null,"Durée de vie attendue de la batterie",null,null,null,{"$f":"INDEX(L:L,MATCH(F82,H:H,0))*(130%-F93)","v":7.2000000000000011},"ans"]
[null,"Convertisseur chargeur victron  8KVA",null,null,null,{"$f":"ROUNDUP(F99/INDEX(C:C,MATCH(F84,B:B,0)),0)","v":2},"unités"]
[null,"Nbre regulateur ",null,null,null,{"$f":"IF(OR(C50=24,C50=12),1,2)","v":2},"unités"]
[null,"Nb régulateurs",{"$nulls":4},"unités"]
[]
[null,"Employés nécessaires pour fonctionnement",null,null,null,4,"personnes"]
[]
[null,"Calcul de charges variables et fixes"]
[]
[null,"CHARGES VARIABLES D'EXPLOITATION"]
[null,"Désignation","Quantité",null,"Prix unitaire","Montant total/an",null,"évolution annuelle charges d'exploitation",null,null,0.03]
[null,"Achat mil tamisé paysan",{"$f":"F79*1000","v":0},"Kilos",180,{"$f":"E119*C119","v":0}]
[null,"Cout de mise en sac",{"$f":"C119","v":0},"Kilos",5,{"$f":"E120*C120","v":0},null,"Avantage coût électricité PV vs. Réseau",null,"Sur 1 an",{"$f":"((MIN(M67,M65)*12)+IF(F89=\"MT\",(G89*D73)+D72+E70+F90,(G89*D73)))-(SUM(F135:F144,F149)+SUM(G135:G144,G149))","v":2700336.0952000003}]
{"$rows_left_out":166}
{"sheet":"investissement réel","index":1,"n_rows":25,"n_cols":6,"rows_kept":25,"cut":false,"hidden":false,"merged":[]}
[]
[]
["Désignation ","Quantité","Prix unitaire TTC","Durée de vie (an)","Montant Total TTC","Amortissement annuel"]
["Moulin à grains",1,1000000,15,{"$f":"B4*C4","v":1000000},{"$f":"E4/D4","v":66666.666666666672}]
["Congélateur 360L",1,400000,7,{"$f":"B5*C5","v":400000},{"$f":"E5/D5","v":57142.857142857145}]
["Banc de recharge de smartphone",1,20000,10,20000,{"$f":"E6/D6","v":2000}]
["Décortiqueuse électrique",1,1000000,15,1000000,66666.666666666672]
["Vibro-tamiseur",1,1300000,15,{"$f":"B8*C8","v":1300000},86666.666666666672]
["Éclairage",3,1500,2,4500,2250]
["Modules PV  (375 Wc)",54,78148.148148148102,20,{"$f":"B10*C10","v":4219999.9999999972},210999.99999999985]
["Onduleur reseau 20 KW",1,1870329,10,1870329,187032.9]
["Batteries OPZS 1220 (Ah)",48,194400.625,7,9331230,1333032.857142857]
["Convertisseur chargeur victron  8KVA",3,1660376,10,{"$f":"B13*C13","v":4981128},498112.8]
["Coffret DC",1,275563,15,275563,18370.866666666665]
["Coffret AC",1,1049763,15,1049763,69984.2]
["Câbles et accessoires ",1,583632,20,583632,29181.599999999999]
["Ensemble mise à la terre et accessoires",1,161755,10,161755,16175.5]
["Coffret pour batteries",1,437401,7,437401,62485.857142857145]
["Batiment",1,10000000,30,10000000,333333.33333333331]
["Local batteries",1,1149167,30,1149167,38305.566666666666]
["Installation",1,1370600,30,1370600,45686.666666666664]
["Support aluminium",14,82500,20,{"$f":"B22*C22","v":1155000},{"$f":"IFERROR(E22/D22,0)","v":57750}]
["Démarreur/variateur",1,925000,15,925000,61666.666666666664]
["Parafoudre ",1,140000,15,140000,9333.3333333333339]
[" TOTAL (F CFA) ",null,null,null,{"$f":"SUM(E4:E24)","v":41375068},2737297.6190476194]

{"sheet":"Remboursement Mensualités","index":2,"n_rows":133,"n_cols":7,"rows_kept":133,"cut":false,"hidden":true,"merged":[]}
["Remboursement de prêt"]
["Taux annuel",{"$f":"'Table rentabilité optimisé'!D189","v":7.0000000000000007E-2}]
["Capital emprunté",{"$f":"'Table rentabilité optimisé'!D188","v":17486305.999999996}]
["Durée du prêt (en année)",{"$f":"'Table rentabilité optimisé'!D190","v":7},{"$f":"B4*12","v":84}]
["Mensualité à régler",{"$f":"-PMT((1+B2)^(1/12)-1,B4*12,B3)","v":262080.97750965811},"Formule mensualité","=-VPM((1+B2)^(1/12)-1;B4*12;B3)"]
[]
["Décomposition de la mensualité"]
["Remboursement du principal",{"$f":"-PPMT((1+B2)^(1/12)-1,1,B4*12,B3)","v":163210.86109700098},"Formule principal","=-PRINCPER((1+B2)^(1/12)-1;1;B4*12;B3)"]
["Remboursement des interêts",{"$f":"-IPMT((1+B2)^(1/12)-1,1,B4*12,B3)","v":98870.116412657138},"Formule intérêt","=-INTPER((1+B2)^(1/12)-1;1;B4*12;B3)"]
[]
[]
["Dans les formules ci-dessous Taux de période = TP =  (1+$B$2)^(1/12)-1"]
["Périodes","Mensualité","Capital","Intérêts","Reste (ou résiduel)","Années"]
[{"$f":"IF(B4<>0,1,\"-\")","v":1},{"$f":"IF(A14<>\"-\",C14+D14,\"\")","v":262080.97750965811},{"$f":"IF(A14<>\"-\",-PPMT((1+$B$2)^(1/12)-1,A14,$B$4*12,$B$3),\"\")","v":163210.86109700098},{"$f":"IF(A14<>\"-\",-IPMT((1+$B$2)^(1/12)-1,A14,$B$4*12,$B$3),\"\")","v":98870.116412657138},{"$f":"IF(A14<>\"-\",$B$3+CUMPRINC((1+$B$2)^(1/12)-1,$B$4*12,$B$3,1,A14,0),\"\")","v":17323095.138902996},{"$f":"IF(A14<>\"-\",1,\"\")","v":1},{"$f":"IF(A14<>\"-\",1,\"\")","v":1}]
[{"$f":"IF(AND($B$4<>0,A14<$C$4),A14+1,\"-\")","v":2},{"$f":"IF(A15<>\"-\",C15+D15,\"\")","v":262080.97750965814},{"$f":"IF(A15<>\"-\",-PPMT((1+$B$2)^(1/12)-1,A15,$B$4*12,$B$3),\"\")","v":164133.67903444704},{"$f":"IF(A15<>\"-\",-IPMT((1+$B$2)^(1/12)-1,A15,$B$4*12,$B$3),\"\")","v":97947.298475211122},{"$f":"IF(A15<>\"-\",$B$3+CUMPRINC((1+$B$2)^(1/12)-1,$B$4*12,$B$3,1,A15,0),\"\")","v":17158961.459868547},{"$f":"IF(A15<>\"-\",IF(G14<G15,F14,F14+1),\"\")","v":1},{"$f":"IF(A15=\"-\",\"\",IF(G14<12,G14+1,1))","v":2}]
[{"$f":"IF(AND($B$4<>0,A15<$C$4),A15+1,\"-\")","v":3},262080.97750965811,165061.71471867748,97019.262790980632,16993899.745149869,{"$f":"IF(A16<>\"-\",IF(G15<G16,F15,F15+1),\"\")","v":1},{"$f":"IF(A16=\"-\",\"\",IF(G15<12,G15+1,1))","v":3}]
[4,262080.97750965814,165994.99765159131,96085.979858066814,16827904.747498281,1,4]
[5,262080.97750965814,166933.55750189541,95147.420007762717,16660971.189996384,1,5]
[6,262080.97750965811,167877.4241060479,94203.553403610218,16493093.765890336,1,6]
[7,262080.97750965811,168826.62746920658,93254.350040451536,16324267.138421129,1,7]
[8,262080.97750965809,169781.19776618277,92299.779743475301,16154485.940654946,1,8]
[9,262080.97750965811,170741.16534240061,91339.812167257507,15983744.775312547,1,9]
[10,262080.97750965814,171706.56071486155,90374.416794796591,15812038.214597683,1,10]
[11,262080.97750965811,172677.41457311469,89403.562936543429,15639360.800024569,1,11]
[12,262080.97750965809,173653.75778023232,88427.219729425778,15465707.042244337,1,12]
[13,262080.97750965814,174635.62137379104,87445.356135867085,15291071.420870546,2,1]
[14,262080.97750965814,175623.03656685833,86457.940942799803,15115448.384303689,2,2]
[15,262080.97750965811,176616.03474898491,85464.942760673206,14938832.349554703,2,3]
[16,262080.97750965809,177614.64748720269,84466.330022455411,14761217.7020675,2,4]
[17,262080.97750965811,178618.90652702807,83462.070982630044,14582598.795540471,2,5]
[18,262080.97750965814,179628.84379347126,82452.133716186872,14402969.951747002,2,6]
[19,262080.97750965814,180644.49139205107,81436.48611760707,14222325.460354948,2,7]
[20,262080.97750965809,181665.88160981558,80415.095899842519,14040659.578745134,2,8]
[21,262080.97750965814,182693.04691636865,79387.930593289493,13857966.531828765,2,9]
[22,262080.97750965814,183726.01996490185,78354.957544756282,13674240.511863863,2,10]
[23,262080.97750965811,184764.8335932327,77316.143916425412,13489475.678270631,2,11]
[24,262080.97750965809,185809.52082484859,76271.456684809513,13303666.157445783,2,12]
[25,262080.97750965811,186860.11486995639,75220.862639701721,13116806.042575825,3,1]
[26,262080.97750965814,187916.6491265384,74164.328383119733,12928889.393449286,3,2]
[27,262080.97750965814,188979.15718141387,73101.820328244256,12739910.236267872,3,3]
[28,262080.97750965809,190047.67281130687,72033.304698351232,12549862.563456567,3,4]
[29,262080.97750965814,191122.22998392006,70958.747525738087,12358740.333472647,3,5]
[30,262080.97750965814,192202.86285901425,69878.114650643882,12166537.470613632,3,6]
[31,262080.97750965814,193289.60578949464,68791.371720163501,11973247.864824139,3,7]
[32,262080.97750965811,194382.49332250268,67698.484187155438,11778865.371501636,3,8]
[33,262080.97750965809,195481.56020051442,66599.417309143682,11583383.811301121,3,9]
[34,262080.97750965814,196586.84136244497,65494.136147213154,11386796.969938675,3,10]
[35,262080.97750965811,197698.37194475898,64382.605564899131,11189098.597993918,3,11]
[36,262080.97750965809,198816.18728258798,63264.790227070116,10990282.410711328,3,12]
[37,262080.97750965809,199940.32291085331,62140.654598804787,10790342.087800477,4,1]
[38,262080.97750965811,201070.81456539605,61010.162944262054,10589271.273235079,4,2]
[39,262080.97750965814,202207.69818411284,59873.279325545285,10387063.575050965,4,3]
[40,262080.97750965814,203351.00990809838,58729.967601559758,10183712.565142868,4,4]
[41,262080.97750965809,204500.78608279442,57580.191426863676,9979211.7790600732,4,5]
[42,262080.97750965811,205657.06325914522,56423.914250512891,9773554.7158009298,4,6]
[43,262080.97750965814,206819.87819475925,55261.099314898878,9566734.8376061693,4,7]
[44,262080.97750965814,207989.26785507787,54091.709654580263,9358745.5697510913,4,8]
[45,262080.97750965811,209165.26941455045,52915.708095107671,9149580.3003365397,4,9]
[46,262080.97750965814,210347.92025781612,51733.057251842016,8939232.3800787255,4,10]
[47,262080.97750965811,211537.25798089211,50543.719528765992,8727695.1220978312,4,11]
[48,262080.97750965811,212733.32039236915,49347.657117288974,8514961.801705461,4,12]
[49,262080.97750965814,213936.14551461308,48144.831995045053,8301025.6561908498,5,1]
[50,262080.97750965811,215145.77158497379,46935.205924684327,8085879.8846058752,5,2]
[51,262080.97750965814,216362.23705700072,45718.74045265741,7869517.6475488767,5,3]
[52,262080.97750965814,217585.58060166525,44495.396907992879,7651932.0669472087,5,4]
[53,262080.97750965809,218815.84110859002,43265.136401068077,7433116.2258386221,5,5]
[54,262080.97750965809,220053.05768728536,42027.919822372729,7213063.1681513321,5,6]
[55,262080.97750965811,221297.26966839237,40783.707841265743,6991765.8984829411,5,7]
[56,262080.97750965814,222548.51660493331,39532.46090472483,6769217.3818780072,5,8]
[57,262080.97750965809,223806.83827356895,38274.139236089148,6545410.543604441,5,9]
[58,262080.97750965811,225072.27467586321,37008.702833794894,6320338.2689285781,5,10]
[59,262080.97750965811,226344.86603955456,35736.111470103555,6093993.4028890207,5,11]
[60,262080.97750965814,227624.652819835,34456.324689823137,5866368.750069188,5,12]
[61,262080.97750965814,228911.675700636,33169.301809022138,5637457.0743685514,6,1]
[62,262080.97750965811,230205.97559592195,31875.001913736174,5407251.0987726282,6,2]
[63,262080.97750965811,231507.59365099075,30573.383858667359,5175743.505121639,6,3]
[64,262080.97750965814,232816.57124378183,29264.406265876318,4942926.9338778555,6,4]
[65,262080.97750965814,234132.94998619135,27948.027523466779,4708793.9838916659,6,5]
[66,{"$f":"IF(A79<>\"-\",C79+D79,\"\")","v":262080.97750965811},{"$f":"IF(A79<>\"-\",-PPMT((1+$B$2)^(1/12)-1,A79,$B$4*12,$B$3),\"\")","v":235456.77172539535},{"$f":"IF(A79<>\"-\",-IPMT((1+$B$2)^(1/12)-1,A79,$B$4*12,$B$3),\"\")","v":26624.205784262766},{"$f":"IF(A79<>\"-\",$B$3+CUMPRINC((1+$B$2)^(1/12)-1,$B$4*12,$B$3,1,A79,0),\"\")","v":4473337.2121662702},6,6]
[{"$f":"IF(AND($B$4<>0,A79<$C$4),A79+1,\"-\")","v":67},262080.97750965811,236788.07854517983,25292.898964478285,4236549.133621091,{"$f":"IF(A80<>\"-\",IF(G79<G80,F79,F79+1),\"\")","v":6},{"$f":"IF(A80=\"-\",\"\",IF(G79<12,G79+1,1))","v":7}]
[68,262080.97750965814,238126.91276727864,23954.064742379502,3998422.2208538111,6,8]
[69,262080.97750965811,239473.31695271877,22607.660556939332,3758948.9039010927,6,9]
[70,262080.97750965814,240827.33390317365,21253.643606484475,3518121.569997916,6,10]
[71,262080.97750965811,242189.00666232337,19891.970847334731,3275932.5633355957,6,11]
[72,262080.97750965809,243558.37851722341,18522.598992434694,3032374.1848183703,6,12]
[73,262080.97750965811,244935.49299968049,17145.484509977628,2787438.6918186899,7,1]
[74,262080.97750965814,246320.39388763648,15760.583622021646,2541118.2979310546,7,2]
[75,262080.97750965814,247713.12520656013,14367.852303098016,2293405.1727244928,7,3]
[76,262080.97750965809,249113.73123084649,12967.246278811599,2044291.441493649,7,4]
[77,262080.97750965809,250522.2564852247,11558.721024433395,1793769.1850084234,7,5]
[78,262080.97750965811,251938.74574617302,10142.231763485095,1541830.4392622486,7,6]
[79,262080.97750965809,253363.24404334239,8717.7334663157017,1288467.1952189077,7,7]
[80,262080.97750965809,254795.7966609881,7285.1808486700002,1033671.39855792,7,8]
[81,262080.97750965814,256236.44913940912,5844.5283702490224,777434.94941850752,7,9]
[82,262080.97750965814,257685.24727639582,4395.7302332623267,519749.70214211568,7,10]
[83,262080.97750965809,259142.23712868599,2938.7403809721059,260607.4650134258,7,11]
[84,262080.97750965811,260607.46501342906,1473.5124962290618,0,7,12]
["-","","","","","",""]
["-","","","","","",""]
["-","","","","","",""]
["-","","","","","",""]
["-","","","","","",""]
["-","","","","","",""]
["-","","","","","",""]
["-","","","","","",""]
["-","","","","","",""]
["-","","","","","",""]
["-","","","","","",""]
["-","","","","","",""]
["-","","","","","",""]
["-","","","","","",""]
["-","","","","","",""]
["-","","","","","",""]
["-","","","","","",""]
["-","","","","","",""]
["-","","","","","",""]
["-","","","","","",""]
["-","","","","","",""]
["-","","","","","",""]
["-","","","","","",""]
{"$rows_left_out":13}