{"text_format":"2","workbook":"xlsx","n_sheets":7,"sheets":["READ ME","Input","Output","Cashflow Calculation","Loan Repayment Solar","Loan Repayment Grid","Loan Repayment Diesel"],"not_rendered":{"charts":8,"images":10,"macros":0,"external_links":0,"defined_names":200,"comments":0,"pivot_tables":0},"unopened":[],"bounds":{"document_bytes":16777216,"sheet_cells":100000,"run_cost":"one","rows_first":2000,"rows_last":500,"rows_between":2000,"halvings":0,"cell_chars":16384,"cell_head_chars":4096},"cells_cut":0,"cells_raw":0,"read":"whole","date_system":"1900"}

{"sheet":"READ ME","index":0,"n_rows":93,"n_cols":7,"rows_kept":93,"cut":false,"hidden":false,"merged":[[10,3,10,9],[15,3,15,9],[17,3,17,9],[84,3,90,9],[92,3,92,5],[18,3,22,9],[39,6,41,9],[39,3,41,5],[50,3,50,4],[50,5,50,9],[51,3,53,4],[51,5,52,9],[53,5,53,7],[54,3,54,4],[54,5,54,7],[42,3,43,5],[23,3,23,9],[69,3,82,9],[49,3,49,4],[49,5,49,7],[56,3,67,9],[45,3,45,9],[46,3,46,4],[46,5,46,6],[42,6,43,9],[47,3,48,4],[47,5,48,9],[36,3,36,9],[25,3,25,9]]}
{"$rows_empty":10}
[null,null,null,"Read Me Sheet"]
[]
[]
[]
[]
[null,null,null,"INVEST – Payback Tool"]
[]
[null,null,null,"Introduction"]
[null,null,null,"This tool allows for a comparative assessment between income and three different irrigation pumping options. Information required for using this tool includes investment and operational costs for the different pumping systems, anticipated income from agricultural production and basic economic conditions (e.g. inflation rate). An alternative tool is available under: "]
[]
[]
[]
[]
[null,null,null,"http://www.fao.org/energy/agrifood-chains/power-irrigation-tool/en/ "]
[]
[null,null,null,"Tips & Tricks"]
{"$rows_empty":10}
[null,null,null,"Overview"]
[null,null,null,"This tool comprises the following sheets:"]
{"$rows_left_out":26}
{"sheet":"Input","index":1,"n_rows":117,"n_cols":11,"rows_kept":117,"cut":false,"hidden":false,"merged":[[0,1,0,8],[94,1,95,1],[116,4,116,5],[85,4,85,5],[34,1,35,1],[63,1,64,1],[53,4,53,5],[93,8,93,10],[17,5,18,10],[15,5,16,10],[11,5,12,10],[9,5,10,10],[21,6,22,10],[19,6,20,10],[5,1,5,10]]}
[null,"INVEST - Payback Tool"]
[]
[null,"This INPUT sheet requires entry of values, which then serve the results displayed in the next OUTPUT sheet."]
[null,null," "]
[]
[null,"Basic assumptions"]
[]
[null,"Currency used for calculation:",null,null,"KES","use any currency"]
[]
[null,"Inflation",null,null,0.115,"the national percentage rate for the devaluation of money per year (provided by national statistics)"]
[]
[null,"Discount rate",null,null,0.16,"the annual rate used to determine the present value of future cash flows (Tip: simplified discount rate is often equal to interest rate earned from bank savings or treasury bonds)"]
[]
[null,"Annual profit margin increase",null,null,0.1,"the rate at which the farmer will increase prices every year (calculated as per own records)"]
[]
[null,"Annual fuel price increase",null,null,3.8399999999999997E-2,"the rate at which the fuel (Diesel, petrol or LPG) will increase every year (as provided by national regulator or from national energy statistics)"]
[]
[null,"Annual electricity price increase",null,null,0.08,"the rate at which the grid electricity prices will increase every year (provided by national electricity regulator or utility)"]
[]
[null,"Total maximum water pumped per day",null,null,26,"m³ per day ","(as calculated in SAFEGUARD WATER-Water Requirement Tool or provided by pump supplier)"]
{"$rows_left_out":98}
{"sheet":"Output","index":2,"n_rows":38,"n_cols":22,"rows_kept":38,"cut":false,"hidden":false,"merged":[[21,1,21,6],[21,9,21,14],[21,17,21,22],[0,8,0,15],[7,18,9,22],[10,18,12,22],[4,9,4,14],[7,1,14,2]]}
[{"$nulls":8},"INVEST – Payback Tool"]
[]
[{"$nulls":8},"This OUTPUT sheet summarises the results as per the entries in the afore completed INPUT sheet."]
[]
[{"$nulls":9},"Basic assumptions"]
[]
[{"$nulls":9},"Total water need per day",null,null,{"$f":"Input!E20 & \" m³ per day\"","v":"26 m³ per day"},{"$nulls":6},"Note:"]
[null,"Click to \nremove/add \nfrom analysis:",{"$nulls":16},"If \"not feasible\" is displayed for the Internal Rate of Return (IRR) then the IRR value is below 0%."]
[{"$nulls":9},"Total income per year",null,null,{"$f":"TEXT(Input!E22,\"#.##0\") &\" \" & Input!E8","v":"594.320 KES"},"(in Year 1)"]
[]
[{"$nulls":9},"Total investment amount per year",null,null,{"$f":"TEXT(Input!E22,\"#.##0\")*Input!E24 &\" \" & Input!E8","v":"297160 KES"},"(in Year 1)",{"$nulls":4},"If a negative (-) Net Present Value (NPV) is displayed then the investment is not feasible."]
[]
[{"$nulls":9},"Inflation",null,null,{"$f":"Input!E10","v":0.115}]
[]
[{"$nulls":9},"Discount rate",null,null,{"$f":"Input!E12","v":0.16}]
[]
[{"$nulls":9},"Annual profit margin increase",null,null,{"$f":"Input!E14","v":0.1}]
[]
[{"$nulls":9},"Annual fuel price increase",null,null,{"$f":"Input!E16","v":3.8399999999999997E-2}]
[]
{"$rows_left_out":19}
{"sheet":"Cashflow Calculation","index":3,"n_rows":196,"n_cols":29,"rows_kept":196,"cut":false,"hidden":true,"merged":[[49,1,50,1],[87,1,88,1],[95,13,95,14],[95,15,95,16],[96,13,96,14],[96,15,96,16],[153,1,154,1],[179,5,179,7]]}
["Annual profit margin increase:",{"$f":"Input!E14","v":0.1}]
["Inflation rate:",{"$f":"Input!E10","v":0.115}]
["Income-Gross farm profit/year:",{"$f":"Input!E22","v":594320},{"$f":"IF(Input!$E$8=\"\",\"\",Input!$E$8)","v":"KES"}]
["Percentage profit to invest",{"$f":"Input!E24","v":0.5}]
["Fuel price increase/year: ",{"$f":"Input!E16","v":3.8399999999999997E-2}]
["Electricity price increase/year: ",{"$f":"Input!E18","v":0.08}]
["Discount rate",{"$f":"Input!E12","v":0.16}]
["Total water need per day",{"$f":"Input!E20","v":26},{"$f":"Input!F20","v":"m³ per day "}]
[]
[null,null,"year",0,1,2,3,4,5,6,7,8,9,10,11,12,13,14,15,16,17,18,19,20,21,22,23,24,25]
[null,null,{"$f":"IF(Input!$E$8=\"\",\"\",Input!$E$8)","v":"KES"},0,{"$f":"B3*B4","v":297160},{"$f":"E11*(1+(1*$B$1))","v":326876},{"$f":"F11*(1+(1*$B$1))","v":359563.60000000003},{"$f":"G11*(1+(1*$B$1))","v":395519.96000000008},435071.95600000012,478579.15160000016,526437.06676000019,579080.77343600022,636988.85077960033,700687.73585756042,770756.50944331649,847832.16038764815,932615.37642641307,1025876.9140690544,1128464.6054759598,1241311.0660235558,1365442.1726259114,1501986.3898885027,1652185.0288773531,1817403.5317650884,1999143.8849415975,2199058.2734357575,2418964.1007793336,2660860.5108572673,2926946.5619429941]
["Capital investment per year:"]
[true,null,"accumulated",{"$f":"IF($A$13=TRUE,D14,NA())","v":0},{"$f":"IF($A$13=TRUE,E14,NA())","v":297160},{"$f":"IF($A$13=TRUE,F14,NA())","v":624036},983599.60000000009,1379119.56,1814191.5160000003,2292770.6676000003,2819207.7343600006,3398288.5077960007,4035277.3585756011,4735965.0944331614,5506721.603876478,6354553.7642641263,7287169.140690539,8313046.0547595937,9441510.660235554,10682821.72625911,12048263.898885023,13550250.288773526,15202435.317650879,17019838.849415965,19018982.734357562,21218041.007793318,23637005.108572651,26297865.619429916,29224812.181372911]
[null,null,null,0,{"$f":"SUM(E11)","v":297160},{"$f":"SUM($E$11:F11)","v":624036},{"$f":"SUM($E$11:G11)","v":983599.60000000009},{"$f":"SUM($E$11:H11)","v":1379119.56},{"$f":"SUM($E$11:I11)","v":1814191.5160000003},{"$f":"SUM($E$11:J11)","v":2292770.6676000003},{"$f":"SUM($E$11:K11)","v":2819207.7343600006},{"$f":"SUM($E$11:L11)","v":3398288.5077960007},{"$f":"SUM($E$11:M11)","v":4035277.3585756011},{"$f":"SUM($E$11:N11)","v":4735965.0944331614},{"$f":"SUM($E$11:O11)","v":5506721.603876478},{"$f":"SUM($E$11:P11)","v":6354553.7642641263},{"$f":"SUM($E$11:Q11)","v":7287169.140690539},{"$f":"SUM($E$11:R11)","v":8313046.0547595937},{"$f":"SUM($E$11:S11)","v":9441510.660235554},{"$f":"SUM($E$11:T11)","v":10682821.72625911},{"$f":"SUM($E$11:U11)","v":12048263.898885023},{"$f":"SUM($E$11:V11)","v":13550250.288773526},{"$f":"SUM($E$11:W11)","v":15202435.317650879},{"$f":"SUM($E$11:X11)","v":17019838.849415965},{"$f":"SUM($E$11:Y11)","v":19018982.734357562},{"$f":"SUM($E$11:Z11)","v":21218041.007793318},{"$f":"SUM($E$11:AA11)","v":23637005.108572651},{"$f":"SUM($E$11:AB11)","v":26297865.619429916},{"$f":"SUM($E$11:AC11)","v":29224812.181372911}]
[]
[]
[]
[]
[]
[{"$f":"Input!D28","v":"Solar powered irrigation system"}]
{"$rows_left_out":154}
{"sheet":"Loan Repayment Solar","index":4,"n_rows":373,"n_cols":10,"rows_kept":373,"cut":false,"hidden":true,"merged":[[0,0,0,4],[0,5,0,9],[2,1,2,3],[2,5,2,7]]}
["Loan Repayment:",{"$nulls":4},{"$f":"Input!D28","v":"Solar powered irrigation system"}]
["Bank:",{"$f":"Input!E54","v":0}]
[null,"Enter Values",null,null,null,"Loan Summary"]
[null,null,"Loan Amount",{"$f":"Input!E51","v":0},null,null,"Scheduled Payment",{"$f":"IF(Values_Entered,-PMT(Interest_Rate/Num_Pmt_Per_Year,Loan_Years*Num_Pmt_Per_Year,Loan_Amount),\"0\")","v":"0"}]
[null,null,"Annual Interest Rate",{"$f":"Input!E52","v":0},null,null,"Scheduled Number of Payments",{"$f":"IF(Values_Entered,Loan_Years*Num_Pmt_Per_Year,\"\")","v":""}]
[null,null,"Loan Period in Years",{"$f":"Input!E53","v":0},null,null,"Actual Number of Payments",{"$f":"IF(Values_Entered,Number_of_Payments,\"\")","v":""}]
[null,null,"Number of Payments Per Year",1,null,null,"Total Early Payments",{"$f":"IF(Values_Entered,SUMIF(Beg_Bal,\">0\",Extra_Pay),\"\")","v":""}]
[null,null,"Start Date of Loan","2017-01-01",null,null,"Total Interest",{"$f":"IF(Values_Entered,SUMIF(Beg_Bal,\">0\",Int),\"\")","v":""}]
[null,null,"Optional Extra Payments",0]
[]
[]
["PmtNo.","Payment Date","Beginning Balance","Scheduled Payment","Extra Payment","Total Payment","Principal","Interest","Ending Balance","Cumulative Interest"]
[]
[{"$f":"IF(Values_Entered,1,\"\")","v":""},{"$f":"IF(Pay_Num<>\"\",DATE(YEAR(Loan_Start),MONTH(Loan_Start)+(Pay_Num)*12/Num_Pmt_Per_Year,DAY(Loan_Start)),\"\")","v":""},{"$f":"IF(Values_Entered,Loan_Amount,\"\")","v":""},{"$f":"IF(Pay_Num<>\"\",Scheduled_Monthly_Payment,\"\")","v":""},{"$f":"IF(AND(Pay_Num<>\"\",Sched_Pay+Scheduled_Extra_Payments<Beg_Bal),Scheduled_Extra_Payments,IF(AND(Pay_Num<>\"\",Beg_Bal-Sched_Pay>0),Beg_Bal-Sched_Pay,IF(Pay_Num<>\"\",0,\"\")))","v":{"$error":"#VALUE!"}},{"$f":"IF(AND(Pay_Num<>\"\",Sched_Pay+Extra_Pay<Beg_Bal),Sched_Pay+Extra_Pay,IF(Pay_Num<>\"\",Beg_Bal,\"\"))","v":{"$error":"#VALUE!"}},{"$f":"IF(Pay_Num<>\"\",Total_Pay-Int,\"\")","v":""},{"$f":"IF(Pay_Num<>\"\",Beg_Bal*(Interest_Rate/Num_Pmt_Per_Year),\"\")","v":""},{"$f":"IF(AND(Pay_Num<>\"\",Sched_Pay+Extra_Pay<Beg_Bal),Beg_Bal-Princ,IF(Pay_Num<>\"\",0,\"\"))","v":{"$error":"#VALUE!"}},{"$f":"SUM($H$14:$H14)","v":0}]
[{"$f":"IF(Values_Entered,A14+1,\"\")","v":""},"",{"$f":"IF(Pay_Num<>\"\",I14,\"\")","v":""},{"$f":"IF(Pay_Num<>\"\",Scheduled_Monthly_Payment,\"\")","v":""},{"$error":"#VALUE!"},{"$error":"#VALUE!"},{"$f":"IF(Pay_Num<>\"\",Total_Pay-Int,\"\")","v":""},{"$f":"IF(Pay_Num<>\"\",Beg_Bal*Interest_Rate/Num_Pmt_Per_Year,\"\")","v":""},{"$error":"#VALUE!"},{"$f":"SUM($H$14:$H15)","v":0}]
[{"$f":"IF(Values_Entered,A15+1,\"\")","v":""},"","",{"$f":"IF(Pay_Num<>\"\",Scheduled_Monthly_Payment,\"\")","v":""},{"$error":"#VALUE!"},{"$error":"#VALUE!"},"","",{"$error":"#VALUE!"},{"$f":"SUM($H$14:$H16)","v":0}]
[{"$f":"IF(Values_Entered,A16+1,\"\")","v":""},"","",{"$f":"IF(Pay_Num<>\"\",Scheduled_Monthly_Payment,\"\")","v":""},{"$error":"#VALUE!"},{"$error":"#VALUE!"},"","",{"$error":"#VALUE!"},{"$f":"SUM($H$14:$H17)","v":0}]
[{"$f":"IF(Values_Entered,A17+1,\"\")","v":""},"","","",{"$error":"#VALUE!"},{"$error":"#VALUE!"},"","",{"$error":"#VALUE!"},{"$f":"SUM($H$14:$H18)","v":0}]
[{"$f":"IF(Values_Entered,A18+1,\"\")","v":""},"","","",{"$error":"#VALUE!"},{"$error":"#VALUE!"},"","",{"$error":"#VALUE!"},{"$f":"SUM($H$14:$H19)","v":0}]
[{"$f":"IF(Values_Entered,A19+1,\"\")","v":""},"","","",{"$error":"#VALUE!"},{"$error":"#VALUE!"},"","",{"$error":"#VALUE!"},{"$f":"SUM($H$14:$H20)","v":0}]
{"$rows_left_out":354}
{"sheet":"Loan Repayment Grid","index":5,"n_rows":373,"n_cols":10,"rows_kept":373,"cut":false,"hidden":true,"merged":[[0,0,0,4],[0,5,0,9],[2,1,2,3],[2,5,2,7]]}
["Loan Repayment:",{"$nulls":4},{"$f":"Input!D58","v":"Grid powered irrigation system"}]
["Bank:",{"$f":"Input!E86","v":0}]
[null,"Enter Values",null,null,null,"Loan Summary"]
[null,null,"Loan Amount",{"$f":"Input!E83","v":0},null,null,"Scheduled Payment",{"$f":"IF(Values_Entered,-PMT(Interest_Rate/Num_Pmt_Per_Year,Loan_Years*Num_Pmt_Per_Year,Loan_Amount),\"0\")","v":"0"}]
[null,null,"Annual Interest Rate",{"$f":"Input!E84","v":0},null,null,"Scheduled Number of Payments",{"$f":"IF(Values_Entered,Loan_Years*Num_Pmt_Per_Year,\"\")","v":""}]
[null,null,"Loan Period in Years",{"$f":"Input!E85","v":0},null,null,"Actual Number of Payments",{"$f":"IF(Values_Entered,Number_of_Payments,\"\")","v":""}]
[null,null,"Number of Payments Per Year",1,null,null,"Total Early Payments",{"$f":"IF(Values_Entered,SUMIF(Beg_Bal,\">0\",Extra_Pay),\"\")","v":""}]
[null,null,"Start Date of Loan","2017-01-01",null,null,"Total Interest",{"$f":"IF(Values_Entered,SUMIF(Beg_Bal,\">0\",Int),\"\")","v":""}]
[null,null,"Optional Extra Payments",0]
[]
[]
["PmtNo.","Payment Date","Beginning Balance","Scheduled Payment","Extra Payment","Total Payment","Principal","Interest","Ending Balance","Cumulative Interest"]
[]
[{"$f":"IF(Values_Entered,1,\"\")","v":""},{"$f":"IF(Pay_Num<>\"\",DATE(YEAR(Loan_Start),MONTH(Loan_Start)+(Pay_Num)*12/Num_Pmt_Per_Year,DAY(Loan_Start)),\"\")","v":""},{"$f":"IF(Values_Entered,Loan_Amount,\"\")","v":""},{"$f":"IF(Pay_Num<>\"\",Scheduled_Monthly_Payment,\"\")","v":""},{"$f":"IF(AND(Pay_Num<>\"\",Sched_Pay+Scheduled_Extra_Payments<Beg_Bal),Scheduled_Extra_Payments,IF(AND(Pay_Num<>\"\",Beg_Bal-Sched_Pay>0),Beg_Bal-Sched_Pay,IF(Pay_Num<>\"\",0,\"\")))","v":{"$error":"#VALUE!"}},{"$f":"IF(AND(Pay_Num<>\"\",Sched_Pay+Extra_Pay<Beg_Bal),Sched_Pay+Extra_Pay,IF(Pay_Num<>\"\",Beg_Bal,\"\"))","v":{"$error":"#VALUE!"}},{"$f":"IF(Pay_Num<>\"\",Total_Pay-Int,\"\")","v":""},{"$f":"IF(Pay_Num<>\"\",Beg_Bal*(Interest_Rate/Num_Pmt_Per_Year),\"\")","v":""},{"$f":"IF(AND(Pay_Num<>\"\",Sched_Pay+Extra_Pay<Beg_Bal),Beg_Bal-Princ,IF(Pay_Num<>\"\",0,\"\"))","v":{"$error":"#VALUE!"}},{"$f":"SUM($H$14:$H14)","v":0}]
[{"$f":"IF(Values_Entered,A14+1,\"\")","v":""},"",{"$f":"IF(Pay_Num<>\"\",I14,\"\")","v":""},{"$f":"IF(Pay_Num<>\"\",Scheduled_Monthly_Payment,\"\")","v":""},{"$error":"#VALUE!"},{"$error":"#VALUE!"},{"$f":"IF(Pay_Num<>\"\",Total_Pay-Int,\"\")","v":""},{"$f":"IF(Pay_Num<>\"\",Beg_Bal*Interest_Rate/Num_Pmt_Per_Year,\"\")","v":""},{"$error":"#VALUE!"},{"$f":"SUM($H$14:$H15)","v":0}]
[{"$f":"IF(Values_Entered,A15+1,\"\")","v":""},"","",{"$f":"IF(Pay_Num<>\"\",Scheduled_Monthly_Payment,\"\")","v":""},{"$error":"#VALUE!"},{"$error":"#VALUE!"},"","",{"$error":"#VALUE!"},{"$f":"SUM($H$14:$H16)","v":0}]
[{"$f":"IF(Values_Entered,A16+1,\"\")","v":""},"","",{"$f":"IF(Pay_Num<>\"\",Scheduled_Monthly_Payment,\"\")","v":""},{"$error":"#VALUE!"},{"$error":"#VALUE!"},"","",{"$error":"#VALUE!"},{"$f":"SUM($H$14:$H17)","v":0}]
[{"$f":"IF(Values_Entered,A17+1,\"\")","v":""},"","","",{"$error":"#VALUE!"},{"$error":"#VALUE!"},"","",{"$error":"#VALUE!"},{"$f":"SUM($H$14:$H18)","v":0}]
[{"$f":"IF(Values_Entered,A18+1,\"\")","v":""},"","","",{"$error":"#VALUE!"},{"$error":"#VALUE!"},"","",{"$error":"#VALUE!"},{"$f":"SUM($H$14:$H19)","v":0}]
[{"$f":"IF(Values_Entered,A19+1,\"\")","v":""},"","","",{"$error":"#VALUE!"},{"$error":"#VALUE!"},"","",{"$error":"#VALUE!"},{"$f":"SUM($H$14:$H20)","v":0}]
{"$rows_left_out":354}
{"sheet":"Loan Repayment Diesel","index":6,"n_rows":373,"n_cols":10,"rows_kept":373,"cut":false,"hidden":true,"merged":[[0,0,0,4],[0,5,0,9],[2,1,2,3],[2,5,2,7]]}
["Loan Repayment:",{"$nulls":4},{"$f":"Input!D58","v":"Grid powered irrigation system"}]
["Bank:",{"$f":"Input!E117","v":0}]
[null,"Enter Values",null,null,null,"Loan Summary"]
[null,null,"Loan Amount",{"$f":"Input!E114","v":0},null,null,"Scheduled Payment",{"$f":"IF(Values_Entered,-PMT(Interest_Rate/Num_Pmt_Per_Year,Loan_Years*Num_Pmt_Per_Year,Loan_Amount),\"0\")","v":"0"}]
[null,null,"Annual Interest Rate",{"$f":"Input!E115","v":0},null,null,"Scheduled Number of Payments",{"$f":"IF(Values_Entered,Loan_Years*Num_Pmt_Per_Year,\"\")","v":""}]
[null,null,"Loan Period in Years",{"$f":"Input!E116","v":0},null,null,"Actual Number of Payments",{"$f":"IF(Values_Entered,Number_of_Payments,\"\")","v":""}]
[null,null,"Number of Payments Per Year",1,null,null,"Total Early Payments",{"$f":"IF(Values_Entered,SUMIF(Beg_Bal,\">0\",Extra_Pay),\"\")","v":""}]
[null,null,"Start Date of Loan","2017-01-01",null,null,"Total Interest",{"$f":"IF(Values_Entered,SUMIF(Beg_Bal,\">0\",Int),\"\")","v":""}]
[null,null,"Optional Extra Payments",0]
[]
[]
["PmtNo.","Payment Date","Beginning Balance","Scheduled Payment","Extra Payment","Total Payment","Principal","Interest","Ending Balance","Cumulative Interest"]
[]
[{"$f":"IF(Values_Entered,1,\"\")","v":""},{"$f":"IF(Pay_Num<>\"\",DATE(YEAR(Loan_Start),MONTH(Loan_Start)+(Pay_Num)*12/Num_Pmt_Per_Year,DAY(Loan_Start)),\"\")","v":""},{"$f":"IF(Values_Entered,Loan_Amount,\"\")","v":""},{"$f":"IF(Pay_Num<>\"\",Scheduled_Monthly_Payment,\"\")","v":""},{"$f":"IF(AND(Pay_Num<>\"\",Sched_Pay+Scheduled_Extra_Payments<Beg_Bal),Scheduled_Extra_Payments,IF(AND(Pay_Num<>\"\",Beg_Bal-Sched_Pay>0),Beg_Bal-Sched_Pay,IF(Pay_Num<>\"\",0,\"\")))","v":{"$error":"#VALUE!"}},{"$f":"IF(AND(Pay_Num<>\"\",Sched_Pay+Extra_Pay<Beg_Bal),Sched_Pay+Extra_Pay,IF(Pay_Num<>\"\",Beg_Bal,\"\"))","v":{"$error":"#VALUE!"}},{"$f":"IF(Pay_Num<>\"\",Total_Pay-Int,\"\")","v":""},{"$f":"IF(Pay_Num<>\"\",Beg_Bal*(Interest_Rate/Num_Pmt_Per_Year),\"\")","v":""},{"$f":"IF(AND(Pay_Num<>\"\",Sched_Pay+Extra_Pay<Beg_Bal),Beg_Bal-Princ,IF(Pay_Num<>\"\",0,\"\"))","v":{"$error":"#VALUE!"}},{"$f":"SUM($H$14:$H14)","v":0}]
[{"$f":"IF(Values_Entered,A14+1,\"\")","v":""},"",{"$f":"IF(Pay_Num<>\"\",I14,\"\")","v":""},{"$f":"IF(Pay_Num<>\"\",Scheduled_Monthly_Payment,\"\")","v":""},{"$error":"#VALUE!"},{"$error":"#VALUE!"},{"$f":"IF(Pay_Num<>\"\",Total_Pay-Int,\"\")","v":""},{"$f":"IF(Pay_Num<>\"\",Beg_Bal*Interest_Rate/Num_Pmt_Per_Year,\"\")","v":""},{"$error":"#VALUE!"},{"$f":"SUM($H$14:$H15)","v":0}]
[{"$f":"IF(Values_Entered,A15+1,\"\")","v":""},"","",{"$f":"IF(Pay_Num<>\"\",Scheduled_Monthly_Payment,\"\")","v":""},{"$error":"#VALUE!"},{"$error":"#VALUE!"},"","",{"$error":"#VALUE!"},{"$f":"SUM($H$14:$H16)","v":0}]
[{"$f":"IF(Values_Entered,A16+1,\"\")","v":""},"","",{"$f":"IF(Pay_Num<>\"\",Scheduled_Monthly_Payment,\"\")","v":""},{"$error":"#VALUE!"},{"$error":"#VALUE!"},"","",{"$error":"#VALUE!"},{"$f":"SUM($H$14:$H17)","v":0}]
[{"$f":"IF(Values_Entered,A17+1,\"\")","v":""},"","","",{"$error":"#VALUE!"},{"$error":"#VALUE!"},"","",{"$error":"#VALUE!"},{"$f":"SUM($H$14:$H18)","v":0}]
[{"$f":"IF(Values_Entered,A18+1,\"\")","v":""},"","","",{"$error":"#VALUE!"},{"$error":"#VALUE!"},"","",{"$error":"#VALUE!"},{"$f":"SUM($H$14:$H19)","v":0}]
[{"$f":"IF(Values_Entered,A19+1,\"\")","v":""},"","","",{"$error":"#VALUE!"},{"$error":"#VALUE!"},"","",{"$error":"#VALUE!"},{"$f":"SUM($H$14:$H20)","v":0}]
{"$rows_left_out":353}