{"text_format":"1","workbook":"xlsx","n_sheets":13,"sheets":["READ ME","1 General Information","2 Equipment & Assets","3 Income Crops & Livestock","4 Other Income","5 Financing","6 Fixed and Variable Costs","7 Farm Income Statement","Crop Price Calculation Sheet","Quick Check","Translate","Graph table","List of dropdown"],"not_rendered":{"charts":1,"images":13,"macros":1,"external_links":0,"defined_names":130,"comments":3,"pivot_tables":0},"unopened":[],"bounds":{"document_bytes":16777216,"sheet_cells":100000,"rows_first":2000,"rows_last":500,"rows_between":2000,"halvings":0,"cell_chars":16384,"cell_head_chars":4096},"cells_cut":0,"cells_raw":0,"read":"whole","date_system":"1900"}

{"sheet":"READ ME","index":0,"n_rows":115,"n_cols":7,"rows_kept":115,"cut":false,"hidden":false,"merged":[[37,3,37,9],[61,5,61,9],[31,3,31,9],[32,3,32,9],[33,3,33,9],[34,3,34,9],[10,3,10,5],[10,6,10,8],[28,3,28,9],[29,3,29,9],[30,3,30,9],[71,3,89,9],[12,3,12,9],[17,3,17,9],[19,3,19,9],[27,3,27,9],[36,3,36,9],[38,3,39,5],[38,6,39,9],[50,3,51,5],[50,6,51,9],[40,3,41,5],[40,6,41,9],[60,3,60,9],[42,3,44,5],[52,6,53,9],[52,3,53,5],[62,5,63,9],[64,3,64,4],[64,5,64,7],[48,3,49,5],[48,6,49,9],[54,6,55,9],[54,3,55,5],[56,6,58,9],[56,3,58,5],[91,3,104,9],[106,3,112,9],[114,3,114,5],[20,3,25,9],[45,6,47,9],[45,3,47,5],[42,6,44,9],[65,3,65,4],[65,5,65,9],[66,3,68,4],[66,5,67,9],[68,5,68,7],[69,3,69,4],[69,5,69,7],[61,3,61,4],[62,3,63,4]]}
[]
[]
[]
[]
[]
[]
[]
[]
[]
[]
{"$rows_left_out":106}
{"sheet":"1 General Information","index":1,"n_rows":36,"n_cols":9,"rows_kept":36,"cut":false,"hidden":false,"merged":[[0,1,0,9],[11,5,11,7],[5,7,5,9],[10,2,10,7],[15,1,15,9],[16,1,16,9],[1,1,2,9],[7,2,7,4],[9,2,9,4],[8,2,8,4],[4,2,4,4],[5,2,5,4],[4,7,4,9],[19,1,19,3],[20,1,20,3],[21,1,21,3],[22,1,22,3],[23,1,23,3],[33,1,33,3],[34,1,34,3],[35,1,35,3],[33,7,34,7],[24,1,24,3],[25,1,25,3],[31,1,31,3],[30,1,30,3],[32,1,32,3]]}
[null,{"$f":"Translate!$C$64","v":"INVEST – Farm Analysis Tool"}]
[null,{"$f":"Translate!$C$65","v":"1 GENERAL FARM INFORMATION"}]
[]
[]
[null,{"$f":"Translate!$C$66","v":"Country"},null,null,null,null,{"$f":"Translate!$C$68","v":"Region"}]
[null,{"$f":"Translate!$C$67","v":"Farm code or name"},null,null,null,null,{"$f":"Translate!$C$69","v":"Date"}]
[]
[null,{"$f":"Translate!$C$70","v":"Village"}]
[null,{"$f":"Translate!$C$71","v":"Division"}]
[null,{"$f":"Translate!$C$72","v":"District"}]
{"$rows_left_out":27}
{"sheet":"2 Equipment & Assets","index":2,"n_rows":38,"n_cols":9,"rows_kept":38,"cut":false,"hidden":false,"merged":[[0,1,0,6],[37,2,37,4],[5,6,8,6],[5,3,8,3],[5,2,8,2],[1,1,1,6],[3,5,3,6],[5,1,9,1],[5,4,8,4],[5,5,8,5],[3,3,3,4]]}
[null,{"$f":"Translate!$C$107","v":"INVEST – Farm Analysis Tool"}]
[null,{"$f":"Translate!$C$108","v":"2 EQUIPMENT & ASSETS"}]
[]
[null,null,null,{"$f":"Translate!$C$109","v":"Farm code/name"},null,{"$f":"'1 General Information'!C6","v":0}]
[]
[null,{"$f":"Translate!$C$110","v":"Type"},{"$f":"Translate!$C$111","v":"Cost of existing equipment (when originally purchased)"},{"$f":"Translate!$C$112","v":"Salvage value (when selling existing equipment)"},{"$f":"Translate!$C$113","v":"Age"},{"$f":"Translate!$C$114","v":"Normal life span"},{"$f":"Translate!$C$115","v":"Annual depreciation for replacement"}]
[]
[]
[]
[null,null,{"$f":"'1 General Information'!D13","v":"€"},{"$f":"'1 General Information'!D13","v":"€"},{"$f":"Translate!$C$116","v":"years"},{"$f":"Translate!$C$116","v":"years"},{"$f":"'1 General Information'!D13","v":"€"}]
{"$rows_left_out":29}
{"sheet":"3 Income Crops & Livestock","index":3,"n_rows":64,"n_cols":16,"rows_kept":64,"cut":false,"hidden":false,"merged":[[20,1,20,7],[24,1,24,7],[19,1,19,6],[35,1,35,6],[34,1,34,2],[33,1,33,2],[32,1,32,2],[28,1,28,2],[26,1,26,2],[27,1,27,2],[29,1,29,2],[30,1,30,2],[58,11,58,13],[59,11,59,13],[62,11,62,13],[60,11,61,15],[63,1,63,6],[57,11,57,13],[31,11,31,15],[55,11,55,13],[36,1,36,7],[41,1,41,3],[41,4,41,7],[39,4,39,5],[0,1,0,7],[3,3,3,5],[16,1,16,2],[17,1,17,2],[18,1,18,2],[1,1,1,7],[3,6,3,7],[7,1,7,7]]}
[null,{"$f":"Translate!$C$162","v":"INVEST – Farm Analysis Tool"}]
[null,{"$f":"Translate!$C$163","v":"INCOME: SEASONAL CROP"}]
[]
[null,null,null,{"$f":"Translate!$C$164","v":"Farm code/name"},null,null,{"$f":"'1 General Information'!C6","v":0}]
[null,null,{"$f":"Translate!$C$166","v":"Season 1"},{"$f":"Translate!$C$167","v":"Season 2"}]
[null,{"$f":"Translate!$C$165","v":"Agricultural land used:"},{"$f":"'List of dropdown'!E24","v":0},{"$f":"'List of dropdown'!E25","v":0},{"$f":"'1 General Information'!D14","v":"ha"}]
[null,null,null,null,{"$f":"Translate!$C$168","v":"Unit"},{"$f":"Translate!$C$169&\" \"& '1 General Information'!D14 &\" \"&Translate!$C$170","v":"Yield per ha or Quantity"},{"$f":"Translate!$C$171","v":"Unit Price"},{"$f":"Translate!$C$172","v":"Value"}]
[null,{"$f":"Translate!$C$173","v":"Sales"}]
[null,{"$f":"Translate!$C$174","v":"Crop types:"},{"$f":"Translate!$C$175","v":"Season:"},{"$f":"Translate!$C$176","v":"Area:"}]
[null,"Tomato",null,0.5,null,null,null,{"$f":"+G10*F10*D10","v":0}]
{"$rows_left_out":55}
{"sheet":"4 Other Income","index":4,"n_rows":15,"n_cols":17,"rows_kept":15,"cut":false,"hidden":false,"merged":[[0,0,0,16],[1,1,1,16],[3,13,3,15],[5,2,6,2],[5,15,6,15],[5,16,6,16],[3,9,3,12]]}
[{"$f":"Translate!$C$220","v":"INVEST – Farm Analysis Tool"}]
[null,{"$f":"Translate!$C$221","v":"4 OTHER INCOME"}]
[]
[null,null,null,null,null,null,null,null,null,{"$f":"Translate!$C$222","v":"Farm code/name"},null,null,null,{"$f":"'1 General Information'!C6","v":0}]
[]
[null,{"$f":"Translate!$C$223","v":"Month"},{"$f":"Translate!$C$224","v":"Monthly/Yearly Costs"},{"$f":"Translate!$C$225","v":"January"},{"$f":"Translate!$C$226","v":"February"},{"$f":"Translate!$C$227","v":"March"},{"$f":"Translate!$C$228","v":"April"},{"$f":"Translate!$C$229","v":"May"},{"$f":"Translate!$C$230","v":"June"},{"$f":"Translate!$C$231","v":"July"},{"$f":"Translate!$C$232","v":"August"},{"$f":"Translate!$C$233","v":"September"},{"$f":"Translate!$C$234","v":"October"},{"$f":"Translate!$C$235","v":"November"},{"$f":"Translate!$C$236","v":"December"},{"$f":"Translate!$C$237","v":"Yearly Costs"},{"$f":"Translate!$C$238","v":"Total"}]
[null,{"$f":"Translate!$C$239","v":"Type of OTHER INCOME"},null,1,2,3,4,5,6,7,8,9,10,11,12]
[null,{"$f":"Translate!$C$240","v":"Sale of water"},null,null,null,null,null,null,null,null,null,null,null,null,null,null,{"$f":"IF(C8='List of dropdown'!$A$29,SUM(D8:O8),IF(C8='List of dropdown'!$A$30,P8,0))","v":0}]
[null,{"$f":"Translate!$C$241","v":"Hire out of equipment"},null,null,null,null,null,null,null,null,null,null,null,null,null,null,{"$f":"IF(C9='List of dropdown'!$A$29,SUM(D9:O9),IF(C9='List of dropdown'!$A$30,P9,0))","v":0}]
[null,{"$f":"Translate!$C$242","v":"Lease out storage space"},null,null,null,null,null,null,null,null,null,null,null,null,null,null,{"$f":"IF(C10='List of dropdown'!$A$29,SUM(D10:O10),IF(C10='List of dropdown'!$A$30,P10,0))","v":0}]
{"$rows_left_out":6}
{"sheet":"5 Financing","index":5,"n_rows":18,"n_cols":11,"rows_kept":18,"cut":false,"hidden":false,"merged":[[3,7,3,9],[17,2,17,5],[0,0,0,13],[1,0,1,13],[5,8,8,8],[6,0,8,0],[6,1,8,1],[6,2,8,2],[6,3,8,3],[6,4,8,4],[6,5,8,5],[6,6,8,6],[6,9,16,13],[3,10,3,12],[5,0,5,6]]}
[{"$f":"Translate!$C$249","v":"INVEST – Farm Analysis Tool"}]
[{"$f":"Translate!$C$250","v":"5 CREDIT AND FINANCING (simplified calculator, to be confirmed with loan provider)"}]
[]
[null,null,null,null,null,null,null,{"$f":"Translate!$C$251","v":"Farm code/name"},null,null,{"$f":"'1 General Information'!C6","v":0}]
[]
[{"$f":"Translate!$C$252","v":"Calculator"},null,null,null,null,null,null,null,{"$f":"Translate!$C$263","v":"Enter manually:"}]
[{"$f":"Translate!$C$253","v":"Bank name"},{"$f":"Translate!$C$254","v":"Loan amount"},{"$f":"Translate!$C$255","v":"Credit period (years)"},{"$f":"Translate!$C$256","v":"Month of taking credit"},{"$f":"Translate!$C$257","v":"Year of taking credit"},{"$f":"Translate!$C$258","v":"Annual interest rate"},{"$f":"Translate!$C$259","v":"Monthly loan repayment"},null,null,{"$f":"Translate!$C$264","v":"Note: the Calculator value will take precedence to the manual value. Ensure calculator value is 0 in order to use manual value."}]
[null,null,null,null,null,null,null,{"$f":"Translate!$C$262","v":"OR"}]
[]
[null,7000,3,1,2018,0.08,{"$f":"IF(D10,-PMT(F10/12,C10*12,B10),\"0\")","v":219.35455823001593}]
{"$rows_left_out":9}
{"sheet":"6 Fixed and Variable Costs","index":6,"n_rows":39,"n_cols":17,"rows_kept":39,"cut":false,"hidden":false,"merged":[[38,1,38,2],[5,1,6,1],[20,1,20,16],[0,0,0,16],[1,1,1,16],[2,1,4,4],[5,2,6,2],[18,1,18,2],[5,15,6,15],[5,16,6,16],[3,10,3,12],[3,13,3,15]]}
[{"$f":"Translate!C266","v":"INVEST – Farm Analysis Tool"}]
[null,{"$f":"Translate!$C$267","v":"6 COSTS (FIXED and VARIABLE)"}]
[]
[null,null,null,null,null,null,null,null,null,null,{"$f":"Translate!$C$268","v":"Farm code/name"},null,null,{"$f":"'1 General Information'!C6","v":0}]
[]
[null,{"$f":"Translate!$C$269","v":"Month"},{"$f":"Translate!$C$270","v":"Monthly/Yearly Costs"},{"$f":"Translate!$C$271","v":"January"},{"$f":"Translate!$C$272","v":"February"},{"$f":"Translate!$C$273","v":"March"},{"$f":"Translate!$C$274","v":"April"},{"$f":"Translate!$C$275","v":"May"},{"$f":"Translate!$C$276","v":"June"},{"$f":"Translate!$C$277","v":"July"},{"$f":"Translate!$C$278","v":"August"},{"$f":"Translate!$C$279","v":"September"},{"$f":"Translate!$C$280","v":"October"},{"$f":"Translate!$C$281","v":"November"},{"$f":"Translate!$C$282","v":"December"},{"$f":"Translate!$C$283","v":"Yearly Costs"},{"$f":"Translate!$C$284","v":"Total"}]
[null,null,null,1,2,3,4,5,6,7,8,9,10,11,12]
[null,{"$f":"Translate!$C$285","v":"FIXED COSTS"}]
[null,{"$f":"Translate!$C$286","v":"Financing fees"},{"$f":"'List of dropdown'!$A$29","v":"Monthly"},{"$f":"'5 Financing'!$G$17","v":219.35455823001593},{"$f":"'5 Financing'!$G$17","v":219.35455823001593},{"$f":"'5 Financing'!$G$17","v":219.35455823001593},{"$f":"'5 Financing'!$G$17","v":219.35455823001593},{"$f":"'5 Financing'!$G$17","v":219.35455823001593},{"$f":"'5 Financing'!$G$17","v":219.35455823001593},{"$f":"'5 Financing'!$G$17","v":219.35455823001593},{"$f":"'5 Financing'!$G$17","v":219.35455823001593},{"$f":"'5 Financing'!$G$17","v":219.35455823001593},{"$f":"'5 Financing'!$G$17","v":219.35455823001593},{"$f":"'5 Financing'!$G$17","v":219.35455823001593},{"$f":"'5 Financing'!$G$17","v":219.35455823001593},{"$f":"SUM(D9:O9)","v":2632.2546987601909},{"$f":"IF(C9='List of dropdown'!$A$29,SUM(D9:O9),IF(C9='List of dropdown'!$A$30,P9,0))","v":2632.2546987601909}]
[null,{"$f":"Translate!$C$287","v":"Depreciation costs"},{"$f":"'List of dropdown'!$A$30","v":"Yearly"},null,null,null,null,null,null,null,null,null,null,null,null,{"$f":"'2 Equipment & Assets'!$G$38","v":2777.7777777777778},{"$f":"IF(C10='List of dropdown'!$A$29,SUM(D10:O10),IF(C10='List of dropdown'!$A$30,P10,0))","v":2777.7777777777778}]
{"$rows_left_out":30}
{"sheet":"7 Farm Income Statement","index":7,"n_rows":64,"n_cols":8,"rows_kept":64,"cut":false,"hidden":false,"merged":[[0,1,0,8],[56,3,56,5],[59,7,59,8],[60,7,60,8],[61,7,61,8],[63,3,63,7],[1,1,1,8],[3,6,3,7],[57,3,57,5],[59,3,59,4],[60,3,60,4],[61,3,61,4],[62,3,62,4],[59,5,59,6],[60,5,60,6],[61,5,61,6],[62,5,62,6],[3,4,3,5],[62,7,62,8]]}
[null,{"$f":"Translate!C313","v":"INVEST – Farm Analysis Tool"}]
[null,{"$f":"Translate!$C$314","v":"7 FARM INCOME STATEMENT"}]
[]
[null,null,null,null,{"$f":"Translate!$C$315","v":"Farm code/name"},null,{"$f":"'1 General Information'!C6","v":0}]
[]
[null,null,"+",{"$f":"Translate!$C$316","v":"Gross value of seasonal crop production"},{"$f":"SUM('3 Income Crops & Livestock'!H10:H15)","v":0},{"$f":"'1 General Information'!$D$13","v":"€"},"+",{"$f":"IF($E$16=0,0,(+E6/$E$16)*(1-$E$14))","v":0}]
[null,null,"+",{"$f":"Translate!$C$317","v":"Gross value of seasonal crop by-product production"},{"$f":"SUM('3 Income Crops & Livestock'!H17:H19)","v":0},{"$f":"'1 General Information'!$D$13","v":"€"},"+",{"$f":"IF($E$16=0,0,(+E7/$E$16)*(1-$E$14))","v":0}]
[null,null,"+",{"$f":"Translate!$C$318","v":"Gross value of perennial crop production"},{"$f":"SUM('3 Income Crops & Livestock'!H27:H31)","v":0},{"$f":"'1 General Information'!$D$13","v":"€"},"+",0]
[null,null,"+",{"$f":"Translate!$C$319","v":"Gross value of perennial crop by-product production"},{"$f":"SUM('3 Income Crops & Livestock'!H33:H35)","v":0},{"$f":"'1 General Information'!$D$13","v":"€"},"+",0]
[null,null,"+",{"$f":"Translate!$C$320","v":"Gross value of livestock production"},{"$f":"SUM('3 Income Crops & Livestock'!H44:H57)","v":0},{"$f":"'1 General Information'!$D$13","v":"€"},"+",0]
{"$rows_left_out":55}
{"sheet":"Crop Price Calculation Sheet","index":8,"n_rows":45,"n_cols":14,"rows_kept":45,"cut":false,"hidden":false,"merged":[[1,0,1,13],[4,0,4,13],[14,0,14,13],[24,0,24,13],[0,0,0,13]]}
[{"$f":"Translate!$C$345","v":"INVEST – Farm Analysis Tool"}]
[{"$f":"Translate!$C$346","v":"Supplementary sheet for calculating average annual costs for selected crops and livestock based on seasonal monthly variations"}]
[null,{"$f":"'6 Fixed and Variable Costs'!D6","v":"January"},{"$f":"'6 Fixed and Variable Costs'!E6","v":"February"},{"$f":"'6 Fixed and Variable Costs'!F6","v":"March"},{"$f":"'6 Fixed and Variable Costs'!G6","v":"April"},{"$f":"'6 Fixed and Variable Costs'!H6","v":"May"},{"$f":"'6 Fixed and Variable Costs'!I6","v":"June"},{"$f":"'6 Fixed and Variable Costs'!J6","v":"July"},{"$f":"'6 Fixed and Variable Costs'!K6","v":"August"},{"$f":"'6 Fixed and Variable Costs'!L6","v":"September"},{"$f":"'6 Fixed and Variable Costs'!M6","v":"October"},{"$f":"'6 Fixed and Variable Costs'!N6","v":"November"},{"$f":"'6 Fixed and Variable Costs'!O6","v":"December"},{"$f":"Translate!$C$347","v":"AVERAGE"}]
[null,{"$f":"'3 Income Crops & Livestock'!$G$7","v":"Unit Price"},{"$f":"'3 Income Crops & Livestock'!$G$7","v":"Unit Price"},{"$f":"'3 Income Crops & Livestock'!$G$7","v":"Unit Price"},{"$f":"'3 Income Crops & Livestock'!$G$7","v":"Unit Price"},{"$f":"'3 Income Crops & Livestock'!$G$7","v":"Unit Price"},{"$f":"'3 Income Crops & Livestock'!$G$7","v":"Unit Price"},{"$f":"'3 Income Crops & Livestock'!$G$7","v":"Unit Price"},{"$f":"'3 Income Crops & Livestock'!$G$7","v":"Unit Price"},{"$f":"'3 Income Crops & Livestock'!$G$7","v":"Unit Price"},{"$f":"'3 Income Crops & Livestock'!$G$7","v":"Unit Price"},{"$f":"'3 Income Crops & Livestock'!$G$7","v":"Unit Price"},{"$f":"'3 Income Crops & Livestock'!$G$7","v":"Unit Price"},{"$f":"'3 Income Crops & Livestock'!$G$7","v":"Unit Price"}]
[{"$f":"Translate!$C$348","v":"Seasonal Crops"}]
[{"$f":"'3 Income Crops & Livestock'!B10","v":"Tomato"},null,null,null,null,null,null,null,null,null,null,null,null,{"$f":"AVERAGE(B6:M6)","v":{"$error":"#DIV/0!"}}]
[{"$f":"'3 Income Crops & Livestock'!B11","v":"Maize"},null,null,null,null,null,null,null,null,null,null,null,null,{"$f":"AVERAGE(B7:M7)","v":{"$error":"#DIV/0!"}}]
[{"$f":"'3 Income Crops & Livestock'!B12","v":"Tomato"},null,null,null,null,null,null,null,null,null,null,null,null,{"$error":"#DIV/0!"}]
[{"$f":"'3 Income Crops & Livestock'!B13","v":"Beans"},null,null,null,null,null,null,null,null,null,null,null,null,{"$error":"#DIV/0!"}]
[{"$f":"'3 Income Crops & Livestock'!B15","v":0},null,null,null,null,null,null,null,null,null,null,null,null,{"$error":"#DIV/0!"}]
{"$rows_left_out":36}
{"sheet":"Quick Check","index":9,"n_rows":33,"n_cols":9,"rows_kept":33,"cut":false,"hidden":false,"merged":[[0,1,0,3],[1,1,1,3],[32,1,32,3],[6,5,6,8],[33,2,33,3],[4,1,4,3],[18,1,18,3]]}
[null,{"$f":"Translate!$C$352","v":"INVEST – Farm Analysis Tool"}]
[null,{"$f":"Translate!$C$353","v":"QUICK CHECK"}]
[]
[]
[null,{"$f":"Translate!$C$354","v":"Annual Expenditure"}]
[null,{"$f":"Translate!$C$355","v":"Expenditure Type"},{"$f":"Translate!$C$356","v":"Examples"},{"$f":"Translate!$C$357","v":"Annual Amount"}]
[null,{"$f":"Translate!$C$358","v":"Seasonal crop expenses"},{"$f":"Translate!$C$367","v":"Seedlings, pesticides, fertilisers, protection, etc"},null,null,{"$f":"Translate!$C$397","v":"Calculator"}]
[null,{"$f":"Translate!$C$359","v":"Perennial crop expenses"},{"$f":"Translate!$C$368","v":"Seedlings, pesticides, fertilisers, protection, etc"},null,null,null,{"$f":"Translate!$C$398","v":"add up:"},{"$f":"Translate!$C$399","v":"multiply:"},{"$f":"Translate!$C$400","v":"divide:"}]
[null,{"$f":"Translate!$C$360","v":"Livestock expenses"},{"$f":"Translate!$C$369","v":"New livestock, fodder, slaughtering, veterinary services, etc"},null,null,{"$f":"Translate!$C$401","v":"a."}]
[null,{"$f":"Translate!$C$361","v":"Operation and maintenance \n- Infrastructure"},{"$f":"Translate!$C$370","v":"Building renovations, painting, plastering, fencing, electricity, water, etc "},null,null,{"$f":"Translate!$C$402","v":"b."}]
{"$rows_left_out":24}
{"sheet":"Translate","index":10,"n_rows":594,"n_cols":9,"rows_kept":594,"cut":false,"hidden":false,"merged":[[1,1,2,2],[4,1,4,8],[6,1,16,1]]}
[]
[null,{"$f":"$C$19","v":"Do not modify this sheet"}]
[]
[]
[null,{"$f":"$C$20","v":"Reference Row"}]
[null,{"$f":"$C$21","v":"Selected Language:"},{"$f":"'READ ME'!$G$11","v":"English"},"English","Français","Español","العربية"]
[null,{"$f":"$C$22","v":"Sheet name"},{"$f":"HLOOKUP($C$6,$D$6:$I$594,ROW()-ROW($B$5),FALSE)","v":"READ ME"},"READ ME","LISER MOI","LÉEME","اقرأ هذه الصفحة"]
[null,null,"1 General Information","1 General Information","1 Informations générales","1 Información general","1 معلومات عامة"]
[null,null,"2 Equipment & Assets","2 Equipment & Assets","2 Équipements et actifs","2 Equipamiento y activos","2 المعدات والأصول"]
[null,null,"3 Income Crops & Livestock","3 Income Crops & Livestock","3 Recettes cultures & élévage","3 Ingresos cultivo y ganado","3 دخل المحاصيل والثروة الحيوانية   "]
{"$rows_left_out":585}
{"sheet":"Graph table","index":11,"n_rows":33,"n_cols":3,"rows_kept":33,"cut":false,"hidden":true,"merged":[]}
[]
[]
[]
[]
[]
[]
[{"$f":"'6 Fixed and Variable Costs'!B8","v":"FIXED COSTS"},{"$f":"'6 Fixed and Variable Costs'!B9","v":"Financing fees"},{"$f":"'6 Fixed and Variable Costs'!Q9","v":2632.2546987601909}]
[null,{"$f":"'6 Fixed and Variable Costs'!B10","v":"Depreciation costs"},{"$f":"'6 Fixed and Variable Costs'!Q10","v":2777.7777777777778}]
[null,{"$f":"'6 Fixed and Variable Costs'!B11","v":"Membership fees "},{"$f":"'6 Fixed and Variable Costs'!Q11","v":0}]
[null,{"$f":"'6 Fixed and Variable Costs'!B12","v":"Insurance costs"},{"$f":"'6 Fixed and Variable Costs'!Q12","v":0}]
{"$rows_left_out":24}
{"sheet":"List of dropdown","index":12,"n_rows":30,"n_cols":5,"rows_kept":30,"cut":false,"hidden":true,"merged":[]}
[]
["Area","CF to ha"]
[{"$f":"Translate!C78","v":"ha"},1]
[{"$f":"Translate!C79","v":"Acre"},2.47105]
[{"$f":"Translate!C80","v":"Sq. km"},0.01]
[{"$f":"Translate!C81","v":"Sq. m"},10000]
[{"$f":"Translate!C82","v":"Sq. yard"},11959.9]
[{"$f":"Translate!C83","v":"Sq. ft"},107639]
[]
[]
{"$rows_left_out":20}