{"text_format":"2","workbook":"xlsx","n_sheets":14,"sheets":["Hoja1","Hoja2","Hoja3 (Muro Concreto)","Hoja3 (Muro Concreto celular)","Hoja3 (Puerta)","Hoja3 (Losa)","Superficie No Homogénea 1 techo","Superficie No Homogénea 2 techo","Edif.REF","Edif. PROY conducc ","Edf. PROY radiacion","Resumen","Etiqueta","Tabla 1"],"not_rendered":{"charts":0,"images":4,"macros":0,"external_links":0,"defined_names":43,"comments":9,"pivot_tables":0},"unopened":[],"bounds":{"document_bytes":16777216,"sheet_cells":100000,"run_cost":"one","rows_first":2000,"rows_last":500,"rows_between":2000,"halvings":0,"cell_chars":16384,"cell_head_chars":4096},"cells_cut":0,"cells_raw":0,"read":"whole","date_system":"1900"}

{"sheet":"Hoja1","index":0,"n_rows":201,"n_cols":20,"rows_kept":201,"cut":false,"hidden":false,"merged":[[16,4,16,8],[36,4,36,8],[26,4,26,8],[50,8,50,9],[44,4,44,8],[46,4,46,8],[30,4,30,8],[42,4,42,8],[28,4,28,8],[34,4,34,8],[54,4,54,8],[1,1,1,9],[2,1,2,9],[52,8,52,9],[48,4,48,8],[24,4,24,8],[40,4,40,8],[50,4,50,5],[52,4,52,5],[32,4,32,8],[18,4,18,8],[20,4,20,8],[8,4,8,8],[10,4,10,8],[12,4,12,8],[14,4,14,8]]}
[]
[null,"FORMATO PARA INFORMAR DEL CALCULO DEL"]
[null,"PRESUPUESTO ENERGÉTICO"]
[]
[null,"1. Datos Generales"]
[]
[null,"1.1. ","Propietario"]
[]
[null,null,"Nombre",null,"Clima cálido"]
[]
[null,null,"Dirección ",null,"Calle limpia"]
[]
[null,null,"Colonia",null,"Modelo"]
[]
[null,null,"Ciudad "]
[]
[null,null,"Estado"]
[]
[null,null,"Codigo Postal"]
[]
{"$rows_left_out":175}
{"sheet":"Hoja2","index":1,"n_rows":62,"n_cols":12,"rows_kept":62,"cut":false,"hidden":false,"merged":[[31,4,31,5],[3,3,3,9],[25,3,25,4],[27,4,27,5],[25,7,25,8],[27,8,27,9]]}
[]
[null,"2. Valores para el Cálculo de la ganancia de Calor a través de la Envolvente (*)"]
[]
[null,"2.1.","Ciudad ",{"$f":"Hoja1!E31","v":"Hermosillo"}]
[]
[null,null,"Latitud",{"$f":"VLOOKUP($D$4,'Tabla 1'!$B$6:$AD$96,27,FALSE)","v":29.9},null,{"$f":"VLOOKUP($D$4,'Tabla 1'!$B$6:$AD$96,28,FALSE)","v":-110.96}]
[]
[null,"2.2.","Temperatura equivalente promedio \"te\" (°C)"]
[]
[null,null,"a). Techo ",{"$f":"VLOOKUP($D$4,'Tabla 1'!$B$6:$AA$96,7,FALSE)","v":48},null,{"$f":"VLOOKUP($D$4,'Tabla 1'!$B$6:$AA$96,5,FALSE)","v":25},"b). Superficie inferior",null,null,{"$f":"VLOOKUP($D$4,'Tabla 1'!$B$6:$AA$96,6,FALSE)","v":33}]
[]
[null,null,"c). Muros",null,null,null,"d). Partes transparentes"]
[]
[null,null,null,"Masivo",null,"Ligero ",null,"Tragaluz y domo ",null,{"$f":"VLOOKUP($D$4,'Tabla 1'!$B$6:$AA$96,16,FALSE)","v":28}]
[]
[null,null,"Norte",{"$f":"VLOOKUP($D$4,'Tabla 1'!$B$6:$AA$96,8,FALSE)","v":34},null,{"$f":"VLOOKUP($D$4,'Tabla 1'!$B$6:$AA$96,12,FALSE)","v":39},null,"Ventana",null,{"$f":"VLOOKUP($D$4,'Tabla 1'!$B$6:$AA$96,17,FALSE)","v":29}]
[]
[null,null,"Este ",{"$f":"VLOOKUP($D$4,'Tabla 1'!$B$6:$AA$96,9,FALSE)","v":38},null,{"$f":"VLOOKUP($D$4,'Tabla 1'!$B$6:$AA$96,13,FALSE)","v":43},null,null,null,{"$f":"VLOOKUP($D$4,'Tabla 1'!$B$6:$AA$96,18,FALSE)","v":30}]
[]
[null,null,"Sur ",{"$f":"VLOOKUP($D$4,'Tabla 1'!$B$6:$AA$96,10,FALSE)","v":35},null,{"$f":"VLOOKUP($D$4,'Tabla 1'!$B$6:$AA$96,14,FALSE)","v":41},null,null,null,{"$f":"VLOOKUP($D$4,'Tabla 1'!$B$6:$AA$96,19,FALSE)","v":31}]
{"$rows_left_out":43}
{"sheet":"Hoja3 (Muro Concreto)","index":2,"n_rows":40,"n_cols":11,"rows_kept":40,"cut":false,"hidden":false,"merged":[[24,2,24,3],[26,2,26,3],[28,2,28,3],[30,2,30,3],[3,5,3,7],[8,2,8,3],[9,2,9,3],[20,2,20,3],[22,2,22,3]]}
[]
[null,"3. Cálculo del Coeficiente Global de Transferencia de Calor de las porciones de la Envolvente(*)"]
[]
[null,"3.1.","Descripcion de la porción ",null,null,"Muro de concreto aparente",null,null,null,"Número(**)",1]
[]
[null,null,"Componente de la envolvente ",{"$nulls":4},"Techo ","X","Pared"]
[]
[]
[null,null,"Material ",null,null,"Espesor",null,"Conductividad ",null,"M"]
[{"$nulls":5},"(m) ",null,"térmica",null,"Aislamiento térmico"]
[{"$nulls":5},1,null,"(w/mK)",null,"(m2K/W)"]
[]
[null,null,"Convección exterior (*****)",null,null,1,null,13,null,{"$f":"F13/H13","v":7.6923076923076927E-2}]
[]
[null,null,"Concreto armado",null,null,0.12,null,1.74,null,{"$f":"F15/H15","v":6.8965517241379309E-2}]
[]
[null,null,"Mortero de cal al interior",null,null,0.01,null,0.69799999999999995,null,{"$f":"F17/H17","v":1.4326647564469915E-2}]
{"$rows_empty":15}
[null,null,"Convección interior",null,null,1,null,8.1,null,{"$f":"F33/H33","v":0.1234567901234568}]
[]
{"$rows_left_out":7}
{"sheet":"Hoja3 (Muro Concreto celular)","index":3,"n_rows":40,"n_cols":11,"rows_kept":40,"cut":false,"hidden":false,"merged":[[22,2,22,3],[24,2,24,3],[26,2,26,3],[28,2,28,3],[30,2,30,3],[20,2,20,3],[3,5,3,7],[8,2,8,3],[9,2,9,3],[14,2,14,3]]}
[]
[null,"3. Cálculo del Coeficiente Global de Transferencia de Calor de las porciones de la Envolvente(*)"]
[]
[null,"3.1.","Descripcion de la porción ",null,null,"Muro de concreto celular",null,null,null,"Número(**)",2]
[]
[null,null,"Componente de la envolvente ",{"$nulls":4},"Techo ","X","Pared"]
[]
[]
[null,null,"Material ",null,null,"Espesor",null,"Conductividad ",null,"M"]
[{"$nulls":5},"(m) ",null,"térmica",null,"Aislamiento térmico"]
[{"$nulls":5},1,null,"(w/mK)",null,"(m2K/W)"]
[]
[null,null,"Convección exterior (*****)",null,null,1,null,13,null,{"$f":"F13/H13","v":7.6923076923076927E-2}]
[]
[null,null,"Mortero de cal al exterior",null,null,0.01,null,0.872,null,{"$f":"F15/H15","v":1.1467889908256881E-2}]
[]
[null,null,"Bloque de concreto celular (densidad 500 kg/m2)",null,null,0.14000000000000001,null,0.19,null,{"$f":"F17/H17","v":0.73684210526315796}]
[]
[null,null,"Mortero de cal al interior",null,null,0.01,null,0.69799999999999995,null,{"$f":"F19/H19","v":1.4326647564469915E-2}]
{"$rows_empty":13}
{"$rows_left_out":9}
{"sheet":"Hoja3 (Puerta)","index":4,"n_rows":40,"n_cols":11,"rows_kept":40,"cut":false,"hidden":false,"merged":[[26,2,26,3],[28,2,28,3],[22,2,22,3],[30,2,30,3],[3,5,3,7],[8,2,8,3],[9,2,9,3],[14,2,14,3],[16,2,16,3],[17,2,17,3],[18,2,18,3],[20,2,20,3],[24,2,24,3]]}
[]
[null,"3. Cálculo del Coeficiente Global de Transferencia de Calor de las porciones de la Envolvente(*)"]
[]
[null,"3.1.","Descripcion de la porción ",null,null,"Puerta exterior",null,null,null,"Número(**)",3]
[]
[null,null,"Componente de la envolvente ",{"$nulls":4},"Techo ","X","Pared"]
[]
[]
[null,null,"Material ",null,null,"Espesor",null,"Conductividad ",null,"M"]
[{"$nulls":5},"(m) ",null,"térmica",null,"Aislamiento térmico"]
[{"$nulls":5},1,null,"(w/mK)",null,"(m2K/W)"]
[]
[null,null,"Convección exterior (*****)",null,null,1,null,13,null,{"$f":"F13/H13","v":7.6923076923076927E-2}]
[]
[null,null,"Madera blanda",null,null,3.5999999999999997E-2,null,0.13,null,{"$f":"F15/H15","v":0.27692307692307688}]
{"$rows_empty":17}
[null,null,"Convección interior",null,null,1,null,8.1,null,{"$f":"F33/H33","v":0.1234567901234568}]
[]
[null,null,"Para optener el aislamiento térmico total, sumar la M de todos",{"$nulls":5},"M",{"$f":"SUM(J13:J33)","v":0.47730294396961059},"m2K/W"]
[null,null," los materiales más la convección exterior e interior"]
{"$rows_left_out":5}
{"sheet":"Hoja3 (Losa)","index":5,"n_rows":40,"n_cols":11,"rows_kept":40,"cut":false,"hidden":false,"merged":[[26,2,26,3],[28,2,28,3],[22,2,22,3],[30,2,30,3],[3,5,3,7],[8,2,8,3],[9,2,9,3],[18,2,18,3],[24,2,24,3],[23,2,23,3]]}
[]
[null,"3. Cálculo del Coeficiente Global de Transferencia de Calor de las porciones de la Envolvente(*)"]
[]
[null,"3.1.","Descripcion de la porción ",null,null,"Losa plana de concreto aislada",null,null,null,"Número(**)",4]
[]
[null,null,"Componente de la envolvente ",null,null,null,"X","Techo ",null,"Pared"]
[]
[]
[null,null,"Material ",null,null,"Espesor",null,"Conductividad ",null,"M"]
[{"$nulls":5},"(m) ",null,"térmica",null,"Aislamiento térmico"]
[{"$nulls":5},1,null,"(w/mK)",null,"(m2K/W)"]
[]
[null,null,"Convección exterior (*****)",null,null,1,null,13,null,{"$f":"F13/H13","v":7.6923076923076927E-2}]
[]
[null,null,"Losa de concreto armado",null,null,0.15,null,1.74,null,{"$f":"F15/H15","v":8.620689655172413E-2}]
[]
[null,null,"Aislante térmico certificado (NOM-018)",null,null,3.7999999999999999E-2,null,0.04,null,{"$f":"F17/H17","v":0.95}]
[]
[null,null,"Mortero de cal al exterior",null,null,1.7000000000000001E-2,null,0.872,null,{"$f":"F19/H19","v":1.9495412844036698E-2}]
[]
{"$rows_left_out":15}
{"sheet":"Superficie No Homogénea 1 techo","index":6,"n_rows":55,"n_cols":14,"rows_kept":55,"cut":false,"hidden":false,"merged":[[138,2,138,3],[114,2,114,3],[115,2,115,3],[120,2,120,3],[122,2,122,3],[124,2,124,3],[126,2,126,3],[128,2,128,3],[130,2,130,3],[132,2,132,3],[134,2,134,3],[136,2,136,3],[4,4,4,6],[109,5,109,7],[56,5,56,7],[61,2,61,3],[62,2,62,3],[67,2,67,3],[69,2,69,3],[73,2,73,3],[75,2,75,3],[77,2,77,3],[79,2,79,3],[81,2,81,3],[83,2,83,3]]}
[]
[null,"3. Cálculo del Coeficiente Global de Transferencia de Calor de las Porciones de la Envolvente (*)"]
[null,"(Háganse tantas hojas como porciones diferentes de la envolvente se tengan) "]
[]
[null,"3.1. ","Descripción de la Porción No Homogénea (a)",null,"losa de vigueta y bovedilla",null,null,null,"Número (**) ",5]
[]
[null,null,"Componente de la envolvente ",null,null,"X","Techo ",null,"Pared"]
[]
[null,null,"Área de la componente en m2 (A)",null,{"$f":"G9*I9","v":0.11},"=",0.11,"x",1]
[]
[]
[null,null,"Área que ocupa la componente no homogénea 1",null,null,null,{"$f":"(G9-G16)*I9","v":9.2399999999999996E-2}]
[]
[null,null,"Fracción de la combinación (F1) (b)",null,{"$f":"G12/E9","v":0.84}]
[]
[null,null,"Área que ocupa la componente no homogénea 2",null,null,null,{"$f":"(0.11*0.16)","v":1.7600000000000001E-2}]
[]
[null,null,"Fracción de la combinación (F2)",null,{"$f":"1-E14","v":0.16000000000000003}]
[]
[]
{"$rows_left_out":36}
{"sheet":"Superficie No Homogénea 2 techo","index":7,"n_rows":40,"n_cols":13,"rows_kept":40,"cut":false,"hidden":false,"merged":[[123,2,123,3],[99,2,99,3],[100,2,100,3],[105,2,105,3],[107,2,107,3],[109,2,109,3],[111,2,111,3],[113,2,113,3],[115,2,115,3],[117,2,117,3],[119,2,119,3],[121,2,121,3],[94,5,94,7],[41,5,41,7],[46,2,46,3],[47,2,47,3],[52,2,52,3],[54,2,54,3],[58,2,58,3],[60,2,60,3],[62,2,62,3],[64,2,64,3],[66,2,66,3],[68,2,68,3]]}
[]
[null,"3. Cálculo del Coeficiente Global de Transferencia de Calor de las Porciones de la Envolvente (*)"]
[null,"(Háganse tantas hojas como porciones diferentes de la envolvente se tengan) "]
[]
[null,3.3,"Aislamiento Térmico parcial (Mparcial)",{"$nulls":5},{"$f":"'Superficie No Homogénea 1 techo'!I41","v":1.2323794267195431}]
[]
[null,null,"Fracción",null,"Material",null,"Grueso  (m)",null,"Conductividad ",null,"g/"]
[null,null,"(F)",null,"(***)",null,"g",null,"térmica"]
[{"$nulls":6},"(****)",null,"(w/mK)"]
[]
[null,"F1",0.84,null,"Material aislante certificado (NOM-018)",null,0.11,null,0.04,null,{"$f":"G11/I11","v":2.75}]
[]
[{"$nulls":10},{"$f":"SUM(K11:K12)","v":2.75}]
[]
[{"$nulls":12},{"$f":"C11/(I5+K13)","v":0.21092917323850882}]
[]
[null,"F2",0.16,null,"Concreto armado",null,{"$f":"G11","v":0.11},null,1.74,null,{"$f":"G17/I17","v":6.3218390804597707E-2}]
[]
[]
[{"$nulls":10},{"$f":"SUM(K17:K19)","v":6.3218390804597707E-2}]
{"$rows_left_out":21}
{"sheet":"Edif.REF","index":8,"n_rows":58,"n_cols":15,"rows_kept":58,"cut":false,"hidden":false,"merged":[[35,9,35,10],[57,9,57,10],[13,6,15,6],[17,6,19,6],[29,6,31,6],[25,6,27,6],[21,6,23,6]]}
[]
[null,"4. Cálculo Comparativo de la Ganancia de Calor "]
[]
[null,4.0999999999999996,"Edificio de referencia"]
[]
[null,"4.1.1. ","Ganancias por conducción (partes opacas y transparentes)"]
[]
[null,null,"Tipo y orientacion",null,"Tranferencia",null,"Area del ",null,"Fracción de la ",null,"Temp.",null,"Temp.",null,"Ganancia por "]
[null,null,"de la porcion de ",null,"de Calor ",null,"edificio ",null,"componente",null,"equivalente",null,"Interior",null,"Conducción "]
[null,null,"la envolvente",null,"(W/m2K)",null,"proyectado",null,"[F]",null,"(te)",null,"(t)",null,"[K*A*F*(te-t)]"]
[{"$nulls":4},"[K]",null,"(m2)"]
[{"$nulls":6},"[A]"]
[]
[null,null,"Techo",null,{"$f":"Hoja2!D26","v":0.47599999999999998},null,{"$f":"Hoja1!D64","v":56.7},null,1,null,{"$f":"Hoja2!D10","v":48},null,{"$f":"Hoja2!F10","v":25},null,{"$f":"(E14*G14*I14*(K14-M14))","v":620.75160000000005}]
[]
[null,null,"Tragaluz y domo",null,{"$f":"Hoja2!E28","v":5.952},null,null,null,0,null,{"$f":"Hoja2!J14","v":28},null,{"$f":"M14","v":25},null,{"$f":"(E16*G14*I16*(K16-M16))","v":0}]
[]
[null,null,"Muro Norte",null,{"$f":"Hoja2!H26","v":0.47599999999999998},null,{"$f":"Hoja1!D66","v":33},null,0.9,null,{"$f":"Hoja2!D16","v":34},null,{"$f":"M14","v":25},null,{"$f":"(E18*G18*I18*(K18-M18))","v":127.23479999999998}]
[]
[null,null,"Ventana Norte",null,{"$f":"Hoja2!I28","v":5.319},null,null,null,0.1,null,{"$f":"Hoja2!J16","v":29},null,{"$f":"M14","v":25},null,{"$f":"(E20*G18*I20*(K20-M20))","v":70.210799999999992}]
{"$rows_left_out":39}
{"sheet":"Edif. PROY conducc ","index":9,"n_rows":64,"n_cols":15,"rows_kept":64,"cut":false,"hidden":false,"merged":[[8,3,8,7],[63,8,63,11]]}
[]
[null,"4. Cálculo Comparativo de la Ganancia de Calor (continuación)"]
[]
[null,4.2,"Edificio proyectado"]
[]
[null,"4.2.1. ","Ganancias por conducción (partes opacas y transparentes)"]
[]
[null,null,"Tipo y orientacion",null,"Coeficiente Global de ",null,null,null,"Area del edificio",null,"Temp.",null,"Temp.",null,"Ganancia por "]
[null,null,"de la porcion de ","Transferencia de Calor (k)",{"$nulls":4},"proyectado",null,"equivalente",null,"Interior",null,"Conducción "]
[null,null,"la envolvente",null,"N° de ",null,"Valor calculado",null,"(m2)",null,"(°C)",null,"(°C)",null,"f pc(****)"]
[null,null,"(*)",null,"porción ",null,"(W/m2K)",null,"[A]",null,"[te]",null,"[t]",null,"[K*A*(te-t)]"]
[{"$nulls":4},"(**)",null,"(***)"]
[{"$nulls":12},"Subtotal 1"]
[]
[{"$nulls":12},"Subtotal 2"]
[]
[{"$nulls":12},"Subtotal 3"]
[]
[null,null,"T1_Techo ",null,{"$f":"'Superficie No Homogénea 1 techo'!J5","v":5},null,{"$f":"'Superficie No Homogénea 2 techo'!I36","v":0.33442428710475203},null,{"$f":"Hoja1!N64-Hoja1!D100","v":37.288800000000002},null,{"$f":"Hoja2!D10","v":48},null,{"$f":"Hoja2!F10","v":25},null,{"$f":"(G19*I19*(K19-M19))","v":286.81644821080857}]
[]
{"$rows_left_out":30}
{"sheet":"Edf. PROY radiacion","index":10,"n_rows":42,"n_cols":17,"rows_kept":42,"cut":false,"hidden":false,"merged":[[5,12,5,14]]}
[]
[null,"4. Cálculo Comparativo de la Ganancia de Calor (continuación)"]
[]
[null,"4.2.2. ","Ganancias por radiación (partes transparentes)"]
[]
[null,null,"Tipo y orientacion",null,null,null,"Coeficiente",null,null,null,"Ganancia",null,"Factor de ",null,null,null,"Ganancia por "]
[null,null,"de la porcion de ",null,"Material",null,"de",null,"Area",null,"de ",null,null,"Sombreado ext.",null,null,"Radiación "]
[null,null,"la envolvente",null,"(**)",null,"Sombreado",null,"(m2)",null,"Calor ",null,null,"[SE]",null,null,"f pr"]
[null,null,"(*)",null,null,null,"(CS)",null,"[A]",null,"(W/m2)",null,null,"(****)",null,null,"[CS*A*FG*SE]"]
[{"$nulls":6},"(***)",null,null,null,"[FG]",null,"Numero",null,"Valor"]
[]
[null,null,"VN_Ventana Norte ",null,"Doble vidrio LowE certificado (NOM-024)",null,0.6,null,{"$f":"Hoja1!D92","v":6.8421000000000003},null,{"$f":"Hoja2!D34","v":70},null,1,null,1,null,{"$f":"G12*I12*K12*O12","v":287.3682}]
[]
[null,null,"VE_Ventana Este ",null,"Doble vidrio LowE certificado (NOM-024)",null,0.6,null,{"$f":"Hoja1!D94","v":2.1235000000000004},null,{"$f":"Hoja2!D36","v":159},null,1,null,1,null,{"$f":"G14*I14*K14*O14","v":202.58190000000005}]
[]
[null,null,"VS_Ventana Sur ",null,"Doble vidrio LowE certificado (NOM-024)",null,0.6,null,{"$f":"Hoja1!D96","v":6.9750000000000005},null,{"$f":"Hoja2!D38","v":131},null,{"$f":"Hoja2!H48","v":2},null,{"$f":"Hoja2!H58","v":0.501},null,{"$f":"G16*I16*K16*O16","v":274.66573499999998}]
[]
[null,null,"VO_Ventana Oeste ",null,"Doble vidrio LowE certificado (NOM-024)",null,0.6,null,{"$f":"Hoja1!D98","v":0.33660000000000001},null,{"$f":"Hoja2!D40","v":164},null,1,null,1,null,{"$f":"G18*I18*K18*O18","v":33.12144}]
[]
[null,null,"D1_Domos ",null,"Doble vidrio LowE certificado (NOM-024)",null,0.6,null,{"$f":"Hoja1!D100","v":1.4111999999999998},null,{"$f":"Hoja2!E32","v":322},null,1,null,1,null,272.64383999999995]
{"$rows_left_out":3}
{"sheet":"Resumen","index":11,"n_rows":34,"n_cols":12,"rows_kept":34,"cut":false,"hidden":false,"merged":[[24,9,24,10],[5,8,11,8],[5,5,11,5]]}
[]
[null,"5. Resumen del Cálculo"]
[]
[null,"5.1. ","Presupuesto Enérgetico"]
[]
[{"$nulls":5},"Ganancia  por Conducción (W)",null,null,"Ganancia  por Radiación (W)",null,null,"Ganancia Total"]
[]
[{"$nulls":11},"f r = f rc + f rs"]
[]
[{"$nulls":11},"f p = f pc + f ps"]
[]
[{"$nulls":11},"(W)"]
[]
[null,null,"Referencia",null,"(f rc)",{"$f":"Edif.REF!O36","v":1751.2349624999999},null,"(f rs)",{"$f":"Edif.REF!M58","v":1982.5934999999999},null,"(f r)",{"$f":"F14+I14","v":3733.8284624999997}]
[]
[]
[]
[null,null,"Proyectado",null,"(f pc)",{"$f":"'Edif. PROY conducc '!O64","v":2592.4717370625713},null,"(f ps)",{"$f":"'Edf. PROY radiacion'!Q42","v":1070.3811150000001},null,"(f p)",{"$f":"F18+I18","v":3662.8528520625714}]
[]
[]
{"$rows_left_out":9}
{"sheet":"Etiqueta","index":12,"n_rows":42,"n_cols":14,"rows_kept":42,"cut":false,"hidden":false,"merged":[[29,12,30,12],[29,8,30,8],[29,7,30,7],[13,3,13,5],[7,2,7,14],[15,6,15,13],[16,6,16,13],[17,6,17,13],[14,3,14,5],[21,12,21,14],[23,12,23,14],[18,6,18,13],[19,6,19,13],[29,13,30,13],[29,10,30,10],[26,3,26,13],[6,2,6,14],[29,5,30,5],[29,6,30,6],[9,2,9,14],[25,3,25,13],[23,2,23,11],[21,2,21,11],[15,3,15,5],[16,3,16,5],[29,11,30,11],[17,3,17,5],[29,9,30,9],[29,3,30,3],[29,4,30,4],[13,6,13,13],[14,6,14,13],[31,3,31,8],[31,9,31,13],[41,2,43,14],[34,2,34,3],[34,4,34,8],[36,2,36,8],[36,9,36,14],[39,2,39,14]]}
[]
[]
[]
[]
[]
[]
[null,null,"EFICIENCIA ENERGETICA"]
[null,null,"Ganancia de Calor "]
[]
[null,null,"Determinada como se establece en la NOM -020-ENER-2011"]
[]
[null,null,"Ubicación de la Edificación "]
[]
[null,null,null,"Nombre",null,null,{"$f":"Hoja1!E25","v":"Casa aislada clima cálido"}]
[null,null,null,"Dirección",null,null,{"$f":"Hoja1!E27","v":0}]
[null,null,null,"Colonia",null,null,{"$f":"Hoja1!E29","v":0}]
[null,null,null,"Ciudad",null,null,{"$f":"Hoja1!E31","v":"Hermosillo"}]
[null,null,null,"Delegación:"]
[null,null,null,"Entidad Federativa",null,null,{"$f":"Hoja1!E33","v":"SONORA"}]
[null,null,null,"Codigo Postal "]
{"$rows_left_out":23}
{"sheet":"Tabla 1","index":13,"n_rows":102,"n_cols":31,"rows_kept":102,"cut":false,"hidden":false,"merged":[[0,0,4,0],[0,1,4,1],[0,2,2,4],[0,5,0,20],[0,21,0,25],[2,21,2,25],[3,3,3,4],[3,5,4,5],[3,6,4,6],[3,7,4,7],[0,26,4,26],[1,21,1,25],[3,16,4,16],[3,21,3,25],[1,5,1,15],[1,16,1,20],[2,5,2,20],[3,8,3,11],[3,12,3,15],[3,17,3,20],[43,0,44,0],[48,0,49,0],[52,0,53,0],[6,0,7,0],[8,0,10,0],[11,0,12,0],[13,0,16,0],[17,0,18,0],[19,0,23,0],[24,0,27,0],[29,0,30,0],[31,0,32,0],[33,0,35,0],[0,27,3,28],[0,29,4,29],[91,0,93,0],[94,0,95,0],[36,0,37,0],[71,0,75,0],[76,0,77,0],[78,0,82,0],[84,0,90,0],[54,0,56,0],[57,0,58,0],[59,0,62,0],[63,0,66,0],[67,0,70,0],[38,0,42,0],[45,0,47,0]]}
["ESTADO","CIUDAD","K de referencia (W/m2 K)",null,null,"CONDUCCIÓN",{"$nulls":15},"RADIACIÓN",{"$nulls":4},"Barrera para vapor","Posición geográfica",null,"Altitud"]
[{"$nulls":5},"OPACA",{"$nulls":10},"TRANSPARENTES",{"$nulls":4},"TRANSPARENTE"]
[{"$nulls":5},"Temperatura equivalente promedio te (°C)"]
[null,null,"Hasta tres niveles  Conjunto horizontal con muros compartidos","Más de tres niveles",null,"T interior","Superficie interior","Techo","Muro masivo",null,null,null,"Muro ligero",null,null,null,"Tragaluz y domo","Ventanas",null,null,null,"Factor de ganancia solar promedio                 FG (W/m2)",{"$nulls":8},"Estados"]
[null,null,"Techo y muro","Techo","Muro",null,null,null,"N","E","S","O","N","E","S","O",null,"N","E","S","O","Tragaluz y domo","N","E","S","O",null,"Latitud","Longitud"]
["AGUASCALIENTES","Aguascalientes",0.83299999999999996,0.83299999999999996,0.90900000000000003,24,26,37,24,27,26,25,30,33,32,32,22,23,24,24,24,274,91,137,118,146,null,21.88,-102.29,1877,"AGUASCALIENTES"]
["BAJA CALIFORNIA SUR","La Paz",0.52600000000000002,0.52600000000000002,0.71399999999999997,25,31,45,31,34,32,33,36,40,38,39,26,27,28,29,29,322,70,159,131,164,"Sí",24.15,-110.31,38,"BAJA_CALIFORNIA_SUR"]
[null,"Cabo S. Lucas",0.52600000000000002,0.52600000000000002,0.71399999999999997,25,30,44,30,34,32,32,36,39,38,39,25,27,28,28,28,322,70,159,131,164,"Sí",22.89,-109.92,24,"BAJA_CALIFORNIA"]
["BAJA CALIFORNIA","Ensenada",0.90900000000000003,0.90900000000000003,0.90900000000000003,24,25,35,22,25,24,23,28,31,30,30,20,22,22,22,23,322,70,159,131,164,"Sí",20.55,-103.3,21,"CAMPECHE"]
[null,"Mexicali",0.47599999999999998,0.47599999999999998,0.55600000000000005,25,34,50,36,40,37,38,41,45,43,45,29,30,32,32,32,322,70,159,131,164,null,20.55,-103.31,5,"COAHUILA"]
[null,"Tijuana",0.71399999999999997,0.71399999999999997,0.90900000000000003,23,26,37,24,27,25,25,30,33,32,32,22,23,24,24,24,322,70,159,131,164,"Sí",20.55,-103.3,20,"COLIMA"]
["CAMPECHE","Campeche",0.52600000000000002,0.52600000000000002,0.625,25,31,45,31,35,33,33,36,40,38,40,26,27,29,29,29,284,95,152,119,133,"Sí",19.84,-90.52,6,"CHIAPAS"]
[null,"Cd. Carmen",0.52600000000000002,0.52600000000000002,0.625,25,31,46,32,35,33,33,37,41,39,40,26,28,29,29,29,284,95,152,119,133,"Sí",18.649999999999999,-91.83,3,"CHIHUAHUA"]
["COAHUILA","Monclova",0.52600000000000002,0.52600000000000002,0.625,25,31,45,31,34,32,33,36,40,38,39,26,27,28,29,29,322,70,159,131,164,null,26.91,-101.42,603,"D.F."]
[null,"Piedras Negras",0.52600000000000002,0.52600000000000002,0.625,25,31,46,32,35,33,33,37,41,39,40,26,28,29,29,29,322,70,159,131,164,"Sí",28.7,-100.53,225,"DURANGO"]
[null,"Saltillo",0.83299999999999996,0.83299999999999996,0.90900000000000003,25,27,38,25,28,26,26,30,34,33,33,22,24,24,24,25,322,70,159,131,164,null,25.43,-101,1582,"GUANAJUATO"]
[null,"Torreón",0.52600000000000002,0.52600000000000002,0.625,25,30,43,30,33,31,31,35,39,37,38,25,27,28,28,28,322,70,159,131,164,null,25.54,-103.41,1125,"GUERRERO"]
["COLIMA","Colima",0.55600000000000005,0.55600000000000005,0.90900000000000003,25,29,42,28,32,30,30,34,38,36,37,24,26,27,27,27,274,91,137,118,146,"Sí",19.239999999999998,-103.73,500,"HIDALGO"]
[null,"Manzanillo",0.52600000000000002,0.52600000000000002,0.625,25,31,45,31,34,32,33,36,40,38,40,26,27,28,29,29,274,91,137,118,146,"Sí",19.5,-104.32,11,"JALISCO"]
["CHIAPAS","Arriaga",0.52600000000000002,0.52600000000000002,0.625,25,31,46,32,35,33,33,37,41,39,40,26,28,29,29,29,272,102,140,114,134,"Sí",16.239999999999998,-93.9,62,"MÉXICO"]
{"$rows_left_out":82}