{"text_format":"2","workbook":"xlsx","n_sheets":10,"sheets":["Lisez Moi","INTRANT_Vérification préliminai","INTRANT_Facteurs de pondération","INTRANT_Paramètres géophysiques","INTRANT_Environnement commercia","RÉSULTAT PRODUIT_Résultat","Calculations","Feuille de Traduction","Lists","Lists 2"],"not_rendered":{"charts":9,"images":45,"macros":0,"external_links":1,"defined_names":26,"comments":1,"pivot_tables":0},"unopened":[],"bounds":{"document_bytes":16777216,"sheet_cells":100000,"run_cost":"one","rows_first":2000,"rows_last":500,"rows_between":2000,"halvings":0,"cell_chars":16384,"cell_head_chars":4096},"cells_cut":0,"cells_raw":0,"read":"whole","date_system":"1900"}

{"sheet":"Lisez Moi","index":0,"n_rows":40,"n_cols":3,"rows_kept":40,"cut":false,"hidden":false,"merged":[]}
[]
[null,null,"Lisez-moi"]
[]
[]
[]
[]
[null,null,"MARCHÉ – Outil d'analyse du marché"]
[]
[null,null,"Introduction"]
[null,null,"Cet outil vient compléter le module MARCHÉ de la boîte à outils SPIS. Il sert à déterminer les paramètres géophysiques décisifs. Si l'un des paramètres obtient un score de 0, la zone est considérée comme ayant un potentiel très faible pour les SPIS. Un \"Oui\" dans cette évaluation permet de prendre en compte d'autres paramètres."]
[]
[null,null,"Conseils et astuces"]
{"$rows_empty":8}
[null,null,"Aperçu"]
[null,null,"Cet outil comprend les feuilles suivantes :"]
{"$rows_left_out":19}
{"sheet":"INTRANT_Vérification préliminai","index":1,"n_rows":31,"n_cols":21,"rows_kept":31,"cut":false,"hidden":false,"merged":[[21,1,22,15],[12,2,12,13],[13,2,13,13],[10,0,11,0],[10,1,11,13],[16,2,17,2],[16,3,17,3],[16,4,17,4],[16,14,17,14],[14,2,14,13],[15,2,15,13],[20,14,20,15],[1,4,1,10],[2,4,2,12],[18,14,19,14],[15,15,19,15],[9,1,9,8],[5,3,5,11],[6,3,6,11],[15,1,17,1],[16,13,17,13],[16,11,17,11],[16,12,17,12],[16,5,17,5],[13,19,16,19],[15,17,16,17],[15,18,16,18],[3,0,3,15],[7,3,7,11],[8,3,8,11],[15,0,19,0],[16,6,17,6],[16,7,17,7],[16,8,17,8],[16,9,17,9],[16,10,17,10]]}
[]
[{"$nulls":4},"INTRANT - Vérification préliminaire"]
[]
[]
[]
[null,"Pays :",null," Angola"]
[null,"Zone spécifique concernée :"]
[null,"Date de l'évaluation :"]
[null,"Nom de l’évaluateur :"]
[]
[1,"Paramètres géophysiques décisifs",{"$nulls":12},"Meilleur score possible","Score obtenu"]
[{"$nulls":14},9,{"$f":"IF(COUNTIF(S14:S17,0)=0,S14+S15+S16,0)","v":7}]
[null,"Questions","Sources des données",{"$nulls":11},"Réponse","Aptitude",null,"Paramètre","Score","Score brut"]
["a)",{"$f":"\"Quel est le type d'occupation des sols prédominant dans la zone concernée ?\"","v":"Quel est le type d'occupation des sols prédominant dans la zone concernée ?"},"Carte mondiale de l'occupation des sols\n",{"$nulls":11},"Medium forest open to closed (tree cover above 40%)",{"$f":"VLOOKUP(O14,'Lists 2'!A:B,2,0)","v":"Marginally Suitable"},null,"Occupation des sols",{"$f":"IF(P14=\"Highly Suitable\", \"3\", IF(P14=\"Moderately Suitable\", \"2\", IF(P14=\"Marginally Suitable\", \"1\", \"0\")))","v":"1"},{"$f":"IF(COUNTIF(S14:S17,0)=0,S14+S15+S16,0)","v":7}]
["b)",{"$f":"\"Quelle est l'irradiation solaire annuelle moyenne de la région ? (kWh/kW crête - valeur PVOUT)\"","v":"Quelle est l'irradiation solaire annuelle moyenne de la région ? (kWh/kW crête - valeur PVOUT)"},"Carte des ressources en énergie solaire de la Banque mondiale",{"$nulls":11},"Above 1460",{"$f":"IF(O15=\"0 - 948\", \"Not Suitable\", IF(O15=\"949 - 1094\", \"Marginally Suitable\", IF(O15=\"1095 - 1460\", \"Moderately Suitable\", \"Highly Suitable\")))","v":"Highly Suitable"},null,"Irradiation solaire",{"$f":"IF(O15=\"Above 1460\", \"3\", IF(O15=\"1095 - 1460\", \"2\", IF(O15=\"949 - 1094\", \"1\", \"0\")))","v":"3"}]
{"$rows_left_out":17}
{"sheet":"INTRANT_Facteurs de pondération","index":2,"n_rows":41,"n_cols":9,"rows_kept":41,"cut":false,"hidden":false,"merged":[[11,1,11,5],[10,1,10,5],[4,5,6,5],[3,0,3,5]]}
[]
[null,null,null,"INTRANT – Facteurs de pondération"]
[]
[]
[]
[null,"Paramètres géophysiques :"]
[null,"Paramètres géophysiques non critiques"]
[null,"Paramètres complémentaires essentiels à l’évaluation du marché d’un SPIS. Ils n’affectent pas la viabilité générale d’un SPIS mais le succès de son adoption dans une région en fonction des conditions géophysiques dominantes (par ex. nappe phréatique, présence de gel, topographie, système de production agricole, etc.)."]
[null,"Important"]
[null,{"$f":"H40","v":0.13636363636363635}]
[]
[null,"Conditions économiques :"]
[null,"1. Action gouvernementale",null,"2. Action des organismes de développement",null,"3. Financement"]
[null,"Évaluation de l'action gouvernementale en tant que paramètre de l’environnement économique d’un SPIS, en consultant les politiques, les règles et les régulations qui régissent les secteurs solaires et ceux de l’irrigation.",null,"Cette section évalue l'action des organismes de développement susceptibles d’avoir une influence significative sur l’adoption de SPIS dans un pays ou une région.",null,"Ce paramètre examine la capacité des utilisateurs finaux à faire face aux coûts d’investissement élevés d’un SPIS ainsi que les subventions du gouvernement, des agences de développement et du secteur privé"]
[null,"Important",null,"Important",null,"Important"]
{"$rows_left_out":27}
{"sheet":"INTRANT_Paramètres géophysiques","index":3,"n_rows":17,"n_cols":10,"rows_kept":17,"cut":false,"hidden":false,"merged":[[14,2,14,3],[15,2,15,3],[16,2,16,3],[11,1,11,5],[4,0,5,0],[6,2,6,3],[4,1,5,3],[3,0,3,5],[13,2,13,3],[10,2,10,3],[1,2,1,3],[7,2,7,3],[8,2,8,3],[9,2,9,3]]}
[]
[null,null,"INTRANT - Paramètres géophysiques"]
[]
[]
[2,"Paramètres géophysiques complémentaires",null,null,"Score maximum","Score obtenu"]
[{"$nulls":4},{"$f":"'INTRANT_Facteurs de pondération'!B10","v":0.13636363636363635},{"$f":"SUM(I8:I11)","v":7.2727272727272724E-2}]
[null,"Questions","Sources de données",null,"Réponse","Pertinence",null,"Pondération","Score obtenu","Score brut"]
["a)","Quel est le niveau de nappe phréatique adapté à un SPIS?","Estimation de la profondeur de la nappe phréatique",null,"50m - 100m","Inconsequential",null,{"$f":"E6/COUNTA(B8,B9,B10,B11)","v":3.4090909090909088E-2},{"$f":"(J8*H8)","v":3.4090909090909094E-3},{"$f":"IF(E8=\"Up to 7m\",1,IF(E8=\"7m - 25m\",0.8,IF(E8=\"25m - 50m\",0.6,IF(E8=\"50m - 100m\",0.1,IF(E8=\"Beyond 100m\",0,IF(E8=\"Unknown\",0))))))*IF(F8=\"Inconsequential\",6,IF(F8=\"Slightly important\",5,IF(F8=\"Important\",4,IF(F8=\"Very important\",3,IF(F8=\"Critical\",2)))))/6","v":0.10000000000000002}]
["b)","Quelle est la température ambiante annuelle minimum et notamment la fréquence du gel ?","Base des températures mondiales de la World Bank",null,"Below 1C","Important",null,{"$f":"(E6/COUNTA(B8,B9,B10,B11))","v":3.4090909090909088E-2},{"$f":"(J9*H9)","v":1.1363636363636362E-2},{"$f":"IF(E9=\"1C to 30C\",(IF(F9=\"Inconsequential\",6,IF(F9=\"Slightly important\",5,IF(F9=\"Important\",4,IF(F9=\"Very important\",3,IF(F9=\"Critical\",2)))))),(IF(F9=\"Inconsequential\",6,IF(F9=\"Slightly important\",4,IF(F9=\"Important\",2,IF(F9=\"Very important\",1,IF(F9=\"Critical\",0)))))))/6","v":0.33333333333333331}]
["c)","Quelle est la topographie générale de la zone considérée ?","Quelle est la pente de la région concernée ?",null,"Flat","Inconsequential",null,{"$f":"(E6/COUNTA(B8,B9,B10,B11))","v":3.4090909090909088E-2},{"$f":"(J10*H10)","v":3.4090909090909088E-2},{"$f":"IF(E10=\"Flat\",1,IF(E10=\"Moderate\",0.8,IF(E10=\"Steep\",0.6)))*IF(F10=\"Inconsequential\",6,IF(F10=\"Slightly important\",5,IF(F10=\"Important\",4,IF(F10=\"Very important\",3,IF(F10=\"Critical\",2)))))/6","v":1}]
["d)","Quel est le type de système de production agricole prédominant ?","Cartes des systèmes agricoles de la FAO",null,"Livestock and Crops","Inconsequential",null,{"$f":"(E6/COUNTA(B8,B9,B10,B11))","v":3.4090909090909088E-2},{"$f":"(J11*H11)","v":2.3863636363636358E-2},{"$f":"IF(E11=\"Seasonal Crops\",0.6,IF(E11=\"Perennial Crops\",0.8,IF(E11=\"Small Livestock\",1,IF(E11=\"Large Livestock\",0.9,IF(E11=\"Seasonal and Perennial Crops\",0.7,IF(E11=\"Livestock and Crops\",0.7))))))*IF(F11=\"Inconsequential\",6,IF(F11=\"Slightly important\",5,IF(F11=\"Important\",4,IF(F11=\"Very important\",3,IF(F11=\"Critical\",2)))))/6","v":0.69999999999999984}]
[null,{"$f":"IF((Calculations!G4)<(50 %), \"Your score is below 50 % of your initial values for Geophysical Parameters! Please revise your weight setting!\", \"\")","v":""}]
[]
[null,null,"Vous disposez de sources de données plus actuelles ? "]
[null,null,"MERCI DE NOUS LES COMMUNIQUER"]
{"$rows_left_out":3}
{"sheet":"INTRANT_Environnement commercia","index":4,"n_rows":108,"n_cols":10,"rows_kept":108,"cut":false,"hidden":false,"merged":[[12,1,12,5],[78,1,78,5],[45,1,45,5],[24,1,24,5],[25,2,25,3],[26,2,26,3],[27,1,27,5],[30,1,30,5],[31,2,31,3],[32,2,32,3],[56,2,56,3],[55,2,55,3],[54,2,54,3],[52,1,53,3],[48,1,48,5],[37,1,37,5],[34,1,35,3],[63,2,65,3],[79,0,80,0],[70,0,71,0],[70,1,71,3],[72,2,72,3],[73,2,73,3],[74,2,74,3],[75,2,75,3],[76,2,76,3],[77,2,77,3],[79,1,80,3],[84,0,85,0],[84,3,87,3],[86,1,87,1],[86,0,87,0],[86,5,87,5],[89,1,90,3],[91,2,91,3],[83,3,83,5],[89,0,90,0],[88,1,88,5],[84,2,87,2],[39,7,43,7],[39,8,43,8],[39,9,43,9],[86,7,87,7],[86,8,87,8],[86,9,87,9],[83,7,85,7],[83,8,85,8],[98,1,98,5],[84,1,85,1],[92,1,92,5],[93,2,96,3],[83,9,85,9],[58,1,58,5],[51,1,51,5],[17,0,18,0],[52,0,53,0],[34,0,35,0],[23,2,23,3],[39,0,43,0],[39,5,43,5],[38,2,38,3],[39,1,43,1],[43,2,43,3],[39,3,40,3],[39,4,43,4],[28,2,29,2],[33,1,33,5],[20,1,20,5],[104,2,104,3],[105,2,105,3],[106,2,106,3],[107,2,107,3],[15,2,15,3],[17,1,18,1],[17,4,19,4],[66,1,66,5],[62,1,62,5],[61,2,61,3],[59,1,60,3],[57,2,57,3],[99,2,101,3],[81,2,81,3],[82,2,82,3],[84,5,85,5],[84,4,85,4],[86,4,87,4],[21,1,22,3],[17,5,19,5],[28,3,29,3],[97,2,97,3],[102,1,102,5],[69,1,69,5],[59,0,60,0],[7,7,9,7],[7,8,9,8],[7,9,9,9],[1,2,1,3],[13,0,14,0],[13,1,14,3],[14,7,14,9],[4,0,5,0],[4,1,5,3],[5,7,5,9],[6,2,6,3],[10,2,10,3],[7,1,9,1],[7,5,9,5],[7,0,9,0],[7,2,9,2],[7,4,9,4],[3,0,3,5],[17,8,19,8],[17,9,19,9],[19,2,19,3],[21,0,22,0],[17,7,19,7]]}
[]
[null,null,"INTRANT - Paramètres Environnement commercial"]
[]
[]
[1,"Action gouvernementale",null,null,"Score maximum possible ","Score obtenu"]
[{"$nulls":4},{"$f":"'INTRANT_Facteurs de pondération'!B16","v":0.13636363636363635},{"$f":" IF(OR(AND(E8=\"No\",F8=\"Critical\"),AND(E11=\"No\",F11=\"Critical\"),AND(E12=\"No\",F12=\"Critical\")),0,SUM(I8:I12))","v":0.13636363636363635}]
[null,"Questions","Sources des données",null,"Réponse","Pertinence",null,"Pondération","Score obtenu","Score brut"]
["a)","Existe-t-il des politiques et des lois gouvernementales et locales de promotion des équipements solaires et d'irrigation ?","• Politiques, projets de loi, lois, décrets, plans de développement sectoriels émis par le gouvernement en matière d'irrigation et/ou d'énergie solaire\n• Accréditation des techniciens, des fournisseurs et des entreprises sous-traitantes du solaire\n• Réglementations douanières et fiscales telles qu'exonérations des droits de douane et de TVA\n","Politiques de développement des énergies renouvelables","Yes","Inconsequential",null,{"$f":"E6/COUNTA(B8:B12)","v":4.5454545454545449E-2},{"$f":"(J8*H8)","v":4.5454545454545449E-2},{"$f":"(IF(E8=\"Yes\",(IF(F8=\"Inconsequential\",6,IF(F8=\"Slightly important\",5,IF(F8=\"Important\",4,IF(F8=\"Very important\",3,IF(F8=\"Critical\",2)))))),(IF(F8=\"Inconsequential\",3,IF(F8=\"Slightly important\",2,IF(F8=\"Important\",1,IF(F8=\"Very important\",1,IF(F8=\"Critical\",0))))))))/6","v":1}]
[null,null,null,"Politique de soutien aux EnR dans les pays en développement : tableau 4, p. 121 "]
[null,null,null,"Documents de politique générale des Pays de l'Asie-Pacifique"]
["b)","Existe-t-il des programmes gouvernementaux faisant la promotion des équipements SPIS ?","• Programme d'irrigation et d'énergie solaires soutenus par des ressources gouvernementales",null,"Yes","Inconsequential",null,{"$f":"E6/COUNTA(B8:B12)","v":4.5454545454545449E-2},{"$f":"(J11*H11)","v":4.5454545454545449E-2},{"$f":"(IF(E11=\"Yes\",(IF(F11=\"Inconsequential\",6,IF(F11=\"Slightly important\",5,IF(F11=\"Important\",4,IF(F11=\"Very important\",3,IF(F11=\"Critical\",2)))))),(IF(F11=\"Inconsequential\",3,IF(F11=\"Slightly important\",2,IF(F11=\"Important\",1,IF(F11=\"Very important\",1,IF(F11=\"Critical\",0))))))))/6","v":1}]
["c)","Existe-t-il des ministères et/ou des organismes gouvernementaux compétents qui apportent un soutien au secteur ?","• Les ministères de l'agriculture et de l'énergie intervenant dans le secteur des SPIS\n• Organismes, comités, groupes de travail gouvernementaux du secteur de l'irrigation\n• Organismes gouvernementaux fournissant des informations relatives aux SPIS\n• Réglementation et application de la qualité et des normes gouvernementales","Réglementations spécifiques des systèmes et incitations","Yes","Inconsequential",null,{"$f":"E6/COUNTA(B8:B12)","v":4.5454545454545449E-2},{"$f":"(J12*H12)","v":4.5454545454545449E-2},{"$f":"(IF(E12=\"Yes\",(IF(F12=\"Inconsequential\",6,IF(F12=\"Slightly important\",5,IF(F12=\"Important\",4,IF(F12=\"Very important\",3,IF(F12=\"Critical\",2)))))),(IF(F12=\"Inconsequential\",3,IF(F12=\"Slightly important\",2,IF(F12=\"Important\",1,IF(F12=\"Very important\",1,IF(F12=\"Critical\",0))))))))/6","v":1}]
[]
[2,"Action des agences de développement",null,null,"Score maximum possible","Score obtenu"]
[{"$nulls":4},{"$f":"'INTRANT_Facteurs de pondération'!D16","v":0.13636363636363635},{"$f":" IF(OR(AND(E17=\"No\",F17=\"Critical\"),AND(E18=\"No\",F18=\"Critical\")),0,SUM(I17:I20))","v":0.13636363636363635}]
{"$rows_left_out":94}
{"sheet":"RÉSULTAT PRODUIT_Résultat","index":5,"n_rows":52,"n_cols":12,"rows_kept":52,"cut":false,"hidden":false,"merged":[[51,1,51,12],[6,1,6,12],[1,3,1,8],[3,2,3,3],[4,2,4,3],[3,6,3,7],[3,8,3,9],[4,6,4,7],[4,8,4,10],[8,1,8,4],[22,1,22,12],[8,7,8,12]]}
[]
[null,null,null,"RÉSULTAT PRODUIT - Résultats de l’analyse du marché  "]
[]
[null,"Pays :",{"$f":"'INTRANT_Vérification préliminai'!D6","v":" Angola"},null,null,null,"Date d'évaluation :",null,{"$f":"'INTRANT_Vérification préliminai'!D8","v":"00:00:00"}]
[null,"Zone spécifique concernée :",{"$f":"'INTRANT_Vérification préliminai'!D7","v":0},null,null,null,"Nom de l'évaluateur :",null,{"$f":"'INTRANT_Vérification préliminai'!D9","v":0}]
[]
[null,"A. Potentiel de marché pour SPIS : scores et pertinences"]
[]
[null,"Score total (%)",{"$nulls":5},"Aperçu des résultats de pertinence "]
{"$rows_empty":13}
[null,"B. Potentiel de marché pour SPIS : score global"]
[]
[]
[]
[{"$nulls":11},"Obstacle majeur à l'accès au marché"]
{"$rows_left_out":6}
{"sheet":"Calculations","index":6,"n_rows":36,"n_cols":7,"rows_kept":36,"cut":false,"hidden":true,"merged":[]}
[]
[]
[null,"Enabling SPIS Business Factors","Initial weight setting","Actually attained score ","Difference ",null,"Attained Score"]
[1,"Geophysical Parameters",{"$f":"'INTRANT_Paramètres géophysiques'!E6","v":0.13636363636363635},{"$f":"'INTRANT_Paramètres géophysiques'!F6","v":7.2727272727272724E-2},{"$f":"C4-D4","v":6.363636363636363E-2},{"$f":"100%-C4","v":0.86363636363636365},{"$f":"D4/C4","v":0.53333333333333333}]
[2,"Government interventions",{"$f":"'INTRANT_Environnement commercia'!E6","v":0.13636363636363635},{"$f":"'INTRANT_Environnement commercia'!F6","v":0.13636363636363635},{"$f":"C5-D5","v":0},{"$f":"100%-C5","v":0.86363636363636365},{"$f":"D5/C5","v":1}]
[3,"Development Organizations Interventions",{"$f":"'INTRANT_Environnement commercia'!E15","v":0.13636363636363635},{"$f":"'INTRANT_Environnement commercia'!F15","v":0.13636363636363635},{"$f":"C6-D6","v":0},{"$f":"100%-C6","v":0.86363636363636365},1]
[4,"Financing",{"$f":"'INTRANT_Environnement commercia'!E23","v":0.13636363636363635},{"$f":"'INTRANT_Environnement commercia'!F23","v":0.13636363636363635},0,0.86363636363636365,1]
[5,"Availability  and cost of alternative sources of power for pumping",{"$f":"'INTRANT_Environnement commercia'!E36","v":0.13636363636363635},{"$f":"'INTRANT_Environnement commercia'!F36","v":9.0909090909090898E-2},4.5454545454545456E-2,0.86363636363636365,0.66666666666666663]
[6,"Technical capacity for SPIS",{"$f":"'INTRANT_Environnement commercia'!E54","v":0.22727272727272727},{"$f":"'INTRANT_Environnement commercia'!F54","v":0.18939393939393939},3.7878787878787873E-2,0.77272727272727271,0.83333333333333337]
[7,"Awareness of solar PV and irrigation technologies ",{"$f":"'INTRANT_Environnement commercia'!E61","v":0},{"$f":"'INTRANT_Environnement commercia'!F61","v":0},0,1,{"$error":"#DIV/0!"}]
[8,"Significance of agriculture in the local economy",{"$f":"'INTRANT_Environnement commercia'!E72","v":9.0909090909090912E-2},{"$f":"'INTRANT_Environnement commercia'!F72","v":4.5454545454545456E-2},4.5454545454545456E-2,0.90909090909090906,0.5]
[9,"Land use rights, ownership and tenure ",{"$f":"'INTRANT_Environnement commercia'!E81","v":0},{"$f":"'INTRANT_Environnement commercia'!F81","v":0},0,1,{"$error":"#DIV/0!"}]
[10,"Transportation and communication infrastructure ",{"$f":"'INTRANT_Environnement commercia'!E91","v":0},{"$f":"'INTRANT_Environnement commercia'!F91","v":0},0,1,{"$error":"#DIV/0!"}]
[null,null,{"$f":"SUM(C4:C13)","v":1},{"$f":"SUM(D4:D13)","v":0.80757575757575761},{"$f":"C14-D14","v":0.19242424242424239}]
[]
{"$rows_left_out":22}
{"sheet":"Feuille de Traduction","index":7,"n_rows":87,"n_cols":3,"rows_kept":87,"cut":false,"hidden":false,"merged":[[1,0,1,2],[4,0,4,4]]}
[]
["FEUILLE DE TRADUCTION"]
[]
["INTRODUCTION"]
["Certains textes utilisés dans cet outil sont utilisés dans des formules qui utilisent la reconnaissance de texte. Afin de préserver l'intégrité et la fonctionnalité de la formule, ces textes resteront en anglais. Une liste de ces textes et leur traduction correspondante est compilée ci-dessous : "]
["Texte original en anglais","Feuille","Traduction francaise"]
["1C to 30C","INPUT_Geophysical Parameters","De 1° C à 30° C "]
["Actually attained score","OUTPUT_Result","Score actuellement obtenu "]
["Additional Geophysical Parameters ","INPUT_Weight setting","Paramètres géophysiques complémentaires"]
["Additional Geophysical Parameters ","OUTPUT_Result","Paramètres géophysiques complémentaires"]
["Availability and Cost of Alternatives","INPUT_Weight setting","Disponibilité et coûts des énergies non solaires"]
["Availability and Cost of Alternatives","OUTPUT_Result","Disponibilité et coûts des énergies non solaires"]
["Awareness of Solar PV and Irrigation Tecnologies","INPUT_Weight setting","Sensibilisation au PV et aux technologies d'irrigation à énergie solaire"]
["Awareness of Solar PV and Irrigation Tecnologies","OUTPUT_Result","Sensibilisation au PV et aux technologies d'irrigation à énergie solaire"]
["Bare areas (sand dunes, gravel plains, etc)","INPUT_Pre-check","Zones dénudées (dunes de sable, plaines de gravier, etc.) "]
{"$rows_left_out":73}
{"sheet":"Lists","index":8,"n_rows":200,"n_cols":7,"rows_kept":200,"cut":false,"hidden":true,"merged":[]}
["Countries","Development Agencies","Facilitites and Funds","Other NGOs, Foundations","Rural MPI","GNI per Capita","pump manufacturers"]
["Afghanistan","African Development Bank","CTF (Clean Technology Fund)","AAA (Adaptation of African Agriculture)","0.10 - 1.86","Low income ($1,005 or less)","AllightSykes"]
["Albania","CGIAR (Climate Change, Agriculture and Food Security)","EcoMicro","AGRA","1.87 - 8.80","Lower Middle Income ($1,006 to $3,955)","Ebara"]
["Algeria","DFID ( Department for International Development - United Kingdom)","GEF (Global Environment Facility)","Energy 4Impact","8.81 - 26.06","Upper Middle Income ($3,956 to $12,235)","Flowserve"]
["Andorra","FAO (Food and Agriculture Organization) ","GPOBA (Global Partnershi on Output Based Aid)","IFPRI (International Food Policy Research Institute)","26.07 - 48.54","High Income ($12.236 or more)","Grundfos"]
["Angola","GACSA (Global Alliance For Climate-Smart Agriculture)","ICBA","Lutheran World Relief","48.55 - 68.29",null,"Kirloskar Brothers Lt"]
["Anguilla","GIZ (Deutsche Gesellschaft für Internationale Zusammenarbeit GmbH)","ICBA (International Center for Biosaline Agriculture)","The Practica Foundation","68.30 - 84.33",null,"KSB"]
["Antigua & Barbuda","IFAD (International Fund for Agriculture Development)",null,null,"84.34 - 96.90",null,"Lorentz"]
["Argentina","JICA (Japan International Cooperation Agency)",null,null,"No data",null,"Ruhrpumpen Group"]
["Armenia","Nordic Development Fund",{"$nulls":4},"Suzler Ltd"]
["Australia","OECD (Organisation for Economic Co-operation and Development)",{"$nulls":4},"Weir Group"]
["Austria","OFID (OPEC Fund for International Development)",{"$nulls":4},"Wilo SE"]
["Azerbaijan","SIDA (Swedish International Development Cooperation Agency)",{"$nulls":4},"Xylem"]
["Bahamas","USAID"]
["Bahrain","World Bank Group"]
{"$rows_left_out":186}
{"sheet":"Lists 2","index":9,"n_rows":241,"n_cols":16,"rows_kept":241,"cut":false,"hidden":true,"merged":[]}
["Column1","Column2","Column3","Column4","Column1",null,null,"Solar Ranges",null,"Groundwater Depth",null,"Topography",null,"Ambient temperature",null,"Population Density"]
["Cropland, rainfed","Highly Suitable",null,null," Afghanistan",null,null,"0 - 948",null,"Up to 7m",null,"Mountainous",null,"Below 1C",null,"<1"]
["Cropland irrigated or post-flooding","Highly Suitable",null,null," Albania",null,null,"949 - 1094",null,"7m - 25m",null,"Steep hills",null,"1C to 30C",null,"1 - 5"]
["Mosaic crop land with natural vegetation","Highly Suitable",null,null," Algeria",null,null,"1095 - 1460",null,"25m - 50m",null,"Rolling hills",null,null,null,"5 - 25"]
["Light forest open (tree cover up to 40%)","Moderately Suitable",null,null," American Samoa",null,null,"Above 1460",null,"50m - 100m",null,"Level",null,null,null,"25 - 250"]
["Medium forest open to closed (tree cover above 40%)","Marginally Suitable",null,null," Andorra",{"$nulls":4},"Beyond 100m",null,"Mixed various",null,null,null,"250 - 1000"]
["Dense forest closed (tree cover above 40%)","Not Suitable",null,null," Angola",{"$nulls":4},"Unknown",{"$nulls":5},">1000"]
["Shrubland","Moderately Suitable",null,null," Anguilla"]
["Grassland","Moderately Suitable",null,null," Antarctica"]
["Lichens and mosses","Marginally Suitable",null,null," Antigua and Barbuda"]
["Semi arid sparse vegetation","Moderately Suitable",null,null," Argentina"]
["Flood plains fresh water","Marginally Suitable",null,null," Armenia"]
["Flood plains brackish water","Not Suitable",null,null," Aruba"]
["Urban areas","Not Suitable",null,null," Australia"]
["Bare areas (sand dunes, gravel plains, etc)","Marginally Suitable",null,null," Austria"]
{"$rows_left_out":226}