{"text_format":"2","workbook":"xlsx","n_sheets":16,"sheets":["Cobija","Riberalta","San Ingacio Velasco","Las Misiones","Valles","Camiri","German Busch","Bermejo","Chiquitos","Huacaraje","Rosario del Yata","El Sena","DESCRIPCION 6","CAP VI-1","Generacion Bruta","Hoja1"],"not_rendered":{"charts":18,"images":13,"macros":0,"external_links":13,"defined_names":1420,"comments":0,"pivot_tables":0},"unopened":[],"bounds":{"document_bytes":16777216,"sheet_cells":100000,"run_cost":"one","rows_first":2000,"rows_last":500,"rows_between":2000,"halvings":0,"cell_chars":16384,"cell_head_chars":4096},"cells_cut":0,"cells_raw":0,"read":"whole","date_system":"1900"}

{"sheet":"Cobija","index":0,"n_rows":62,"n_cols":15,"rows_kept":62,"cut":false,"hidden":false,"merged":[[1,1,1,3],[1,5,1,10],[3,5,3,9],[16,5,16,7]]}
[]
[null,"FICHA TECNICA DEL SISTEMA AISLADO",null,null,null,"PROYECTOS POREVISTOS"]
[null,null,1,"S1"]
[2,"Departamento",{"$f":"VLOOKUP($C$3,'[11]Potencia Inst y Efect'!$A$9:$W$40,A4,0)","v":"Pando"},null,null,"NO TIENE PROYECTOS PREVISTOS, SOLO EXPANSION COMB. FOSIL",{"$nulls":4},"X"]
[3,"Provincia",{"$f":"VLOOKUP($C$3,'[11]Potencia Inst y Efect'!$A$9:$W$40,A5,0)","v":"Nicolas Suarez"}]
[4,"Sistema Eléctrico",{"$f":"VLOOKUP($C$3,'[11]Potencia Inst y Efect'!$A$9:$W$40,A6,0)","v":"Cobija"}]
[5,"Empresa",{"$f":"VLOOKUP($C$3,'[11]Potencia Inst y Efect'!$A$9:$W$40,A7,0)","v":"ENDE"}]
[6,"Combustible",{"$f":"VLOOKUP($C$3,'[11]Potencia Inst y Efect'!$A$9:$W$40,A8,0)","v":"Diesel"}]
[10,"Potencia Instalada MVA",{"$f":"VLOOKUP($C$3,'[11]Potencia Inst y Efect'!$A$9:$W$40,A9,0)","v":28.199999999999996}]
[15,"Potencia Instalada MW",{"$f":"VLOOKUP($C$3,'[11]Potencia Inst y Efect'!$A$9:$W$40,A10,0)","v":22.560000000000002}]
[21,"Potencia a Temp. Media",{"$f":"VLOOKUP($C$3,'[11]Potencia Inst y Efect'!$A$9:$W$40,A11,0)","v":19.500000000000004}]
[null,"Consumo especifico (lts/kWh)",{"$f":"SUM(F26:H26)/SUM(F25:H25)","v":0.26606625750993845}]
[8,"Energía Alternativa",null,"Solar"]
[11,"Potencia Instalada MVA",null,{"$f":"VLOOKUP($D$3,'[11]Potencia Inst y Efect'!$A$9:$W$40,A14,0)","v":5.0999999999999996}]
[16,"Potencia Instalada MW",null,{"$f":"VLOOKUP($D$3,'[11]Potencia Inst y Efect'!$A$9:$W$40,A15,0)","v":5.0999999999999996}]
{"$rows_left_out":48}
{"sheet":"Riberalta","index":1,"n_rows":104,"n_cols":15,"rows_kept":104,"cut":false,"hidden":false,"merged":[[1,1,1,3],[1,5,1,10],[16,5,16,7],[72,1,75,4],[76,1,76,4]]}
[]
[null,"FICHA TECNICA DEL SISTEMA AISLADO",null,null,null,"PROYECTOS PREVISTOS"]
[null,null,5]
[2,"Departamento",{"$f":"VLOOKUP($C$3,'[11]Potencia Inst y Efect'!$A$9:$W$40,A4,0)","v":"Beni"},null,null,"Hibridación/Desplazamiento de energía fósil",{"$nulls":4},"X"]
[3,"Provincia",{"$f":"VLOOKUP($C$3,'[11]Potencia Inst y Efect'!$A$9:$W$40,A5,0)","v":"Vaca Diez"}]
[4,"Sistema Eléctrico",{"$f":"VLOOKUP($C$3,'[11]Potencia Inst y Efect'!$A$9:$W$40,A6,0)","v":"Riberalta"},null,null,"Proyecto:","Planta Solar Riberalta"]
[5,"Empresa",{"$f":"VLOOKUP($C$3,'[11]Potencia Inst y Efect'!$A$9:$W$40,A7,0)","v":"CER Ltda."},null,null,null,"Potencia Instalada MW",5000,"kWp"]
[6,"Combustible",{"$f":"VLOOKUP($C$3,'[11]Potencia Inst y Efect'!$A$9:$W$40,A8,0)","v":"Diesel"},null,null,null,"Potencia a Temp. Media",{"$f":"+H7*0.95","v":4750},"kWp"]
[10,"Potencia Instalada MVA",{"$f":"VLOOKUP($C$3,'[11]Potencia Inst y Efect'!$A$9:$W$40,A9,0)","v":22.029999999999998},null,null,null,"Mes/Año de puesta en operación","2021-05-01"]
[15,"Potencia Instalada MW",{"$f":"VLOOKUP($C$3,'[11]Potencia Inst y Efect'!$A$9:$W$40,A10,0)","v":16.120000000000005},null,null,null,"Factor de Planta",0.13736980593607304]
[21,"Potencia a Temp. Media",{"$f":"VLOOKUP($C$3,'[11]Potencia Inst y Efect'!$A$9:$W$40,A11,0)","v":15.779999999999992},null,null,null,"Categoría","Pequeña Escala"]
[null,"Consumo especifico (lts/kWh)",{"$f":"SUM(F26:H26)/SUM(F25:H25)","v":0.29016212958142484},null,null,null,"Metodología Aplicable","AMS I.A"]
[8,"Energía Alternativa"]
[11,"Potencia Instalada MVA"]
[16,"Potencia Instalada MW"]
{"$rows_left_out":82}
{"sheet":"San Ingacio Velasco","index":2,"n_rows":105,"n_cols":15,"rows_kept":105,"cut":false,"hidden":false,"merged":[[73,1,73,4],[1,1,1,3],[1,5,1,10],[3,5,4,9],[3,10,4,10],[17,5,17,7],[69,1,72,4]]}
[]
[null,"FICHA TECNICA DEL SISTEMA AISLADO",null,null,null,"PROYECTOS PREVISTOS"]
[null,null,19]
[2,"Departamento",{"$f":"VLOOKUP($C$3,'[11]Potencia Inst y Efect'!$A$9:$W$40,A4,0)","v":"Santa Cruz"},null,null,"Electrificación mediante la extensión de una red (nacional, regional o mini-red)",{"$nulls":4},"X"]
[3,"Provincia",{"$f":"VLOOKUP($C$3,'[11]Potencia Inst y Efect'!$A$9:$W$40,A5,0)","v":"Jose Miguel de Velasco"}]
[4,"Sistema Eléctrico",{"$f":"VLOOKUP($C$3,'[11]Potencia Inst y Efect'!$A$9:$W$40,A6,0)","v":"San Ignacio de Velasco"}]
[5,"Empresa",{"$f":"VLOOKUP($C$3,'[11]Potencia Inst y Efect'!$A$9:$W$40,A7,0)","v":"CRE Ltda."},null,null,"Proyecto:","Conexión al SIN San Ignacio"]
[6,"Combustible",{"$f":"VLOOKUP($C$3,'[11]Potencia Inst y Efect'!$A$9:$W$40,A8,0)","v":"Diesel"},null,null,"Línea:","230 kV (Los Troncos - San Ignacio)"]
[10,"Potencia Instalada MVA",{"$f":"VLOOKUP($C$3,'[11]Potencia Inst y Efect'!$A$9:$W$40,A9,0)","v":9.8000000000000007},null,null,null,"Mes/Año de puesta en operación","2023-11-01"]
[15,"Potencia Instalada MW",{"$f":"VLOOKUP($C$3,'[11]Potencia Inst y Efect'!$A$9:$W$40,A10,0)","v":7.84},null,null,null,"Categoría","Gran Escala"]
[21,"Potencia a Temp. Media",{"$f":"VLOOKUP($C$3,'[11]Potencia Inst y Efect'!$A$9:$W$40,A11,0)","v":6.7919999999999998},null,null,null,"Metodología Aplicable","AM00045"]
[null,"Consumo especifico (lt/kWh)",{"$f":"SUM(F26:H26)/SUM(F25:H25)","v":0.27718065536918751}]
[8,"Energía Alternativa"]
[11,"Potencia Instalada MVA"]
[16,"Potencia Instalada MW"]
{"$rows_left_out":84}
{"sheet":"Las Misiones","index":3,"n_rows":111,"n_cols":15,"rows_kept":111,"cut":false,"hidden":false,"merged":[[78,1,78,4],[1,1,1,3],[1,5,1,10],[3,5,4,9],[3,10,4,10],[17,5,17,7],[74,1,77,4]]}
[]
[null,"FICHA TECNICA DEL SISTEMA AISLADO",null,null,null,"PROYECTOS PREVISTOS"]
[null,null,17]
[2,"Departamento",{"$f":"VLOOKUP($C$3,'[11]Potencia Inst y Efect'!$A$9:$W$40,A4,0)","v":"Santa Cruz"},null,null,"Electrificación mediante la extensión de una red (nacional, regional o mini-red)",{"$nulls":4},"X"]
[3,"Provincia",{"$f":"VLOOKUP($C$3,'[11]Potencia Inst y Efect'!$A$9:$W$40,A5,0)","v":"Guarayos"}]
[4,"Sistema Eléctrico",{"$f":"VLOOKUP($C$3,'[11]Potencia Inst y Efect'!$A$9:$W$40,A6,0)","v":"Las Misiones"}]
[5,"Empresa",{"$f":"VLOOKUP($C$3,'[11]Potencia Inst y Efect'!$A$9:$W$40,A7,0)","v":"CRE Ltda."},null,null,"Proyecto:","Conexión al SIN Las Misiones"]
[6,"Combustible",{"$f":"VLOOKUP($C$3,'[11]Potencia Inst y Efect'!$A$9:$W$40,A8,0)","v":"Gas/Diesel"},null,null,"Línea:","230 kV (Los Troncos - Guarayos)"]
[10,"Potencia Instalada MVA",{"$f":"VLOOKUP($C$3,'[11]Potencia Inst y Efect'!$A$9:$W$40,A9,0)","v":27.8},null,null,null,"Mes/Año de puesta en operación","2020-12-01"]
[15,"Potencia Instalada MW",{"$f":"VLOOKUP($C$3,'[11]Potencia Inst y Efect'!$A$9:$W$40,A10,0)","v":21.349999999999994},null,null,null,"Categoría","Gran Escala"]
[21,"Potencia a Temp. Media",{"$f":"VLOOKUP($C$3,'[11]Potencia Inst y Efect'!$A$9:$W$40,A11,0)","v":19.05},null,null,null,"Metodología Aplicable","AM00045"]
[null,"Consumo especifico (pc/kWh)",{"$f":"SUM(F29:H29)/SUM(F27:H27)","v":13.231302586681062}]
[null,"Consumo especifico (lt/kWh)",0.27718065536918751]
[8,"Energía Alternativa"]
[11,"Potencia Instalada MVA"]
{"$rows_left_out":90}
{"sheet":"Valles","index":4,"n_rows":68,"n_cols":15,"rows_kept":68,"cut":false,"hidden":false,"merged":[[1,1,1,3],[1,5,1,10],[17,5,17,7]]}
[]
[null,"FICHA TECNICA DEL SISTEMA AISLADO",null,null,null,"PROYECTOS PREVISTOS"]
[null,null,20]
[2,"Departamento",{"$f":"VLOOKUP($C$3,'[11]Potencia Inst y Efect'!$A$9:$W$40,A4,0)","v":"Santa Cruz"},null,null,"NO TIENE PROYECTOS PREVISTOS, SOLO EXPANSION COMB. FOSIL",{"$nulls":4},"X"]
[3,"Provincia",{"$f":"VLOOKUP($C$3,'[11]Potencia Inst y Efect'!$A$9:$W$40,A5,0)","v":"Vallegrande"}]
[4,"Sistema Eléctrico",{"$f":"VLOOKUP($C$3,'[11]Potencia Inst y Efect'!$A$9:$W$40,A6,0)","v":"Valles Cruceños"}]
[5,"Empresa",{"$f":"VLOOKUP($C$3,'[11]Potencia Inst y Efect'!$A$9:$W$40,A7,0)","v":"CRE Ltda."}]
[6,"Combustible",{"$f":"VLOOKUP($C$3,'[11]Potencia Inst y Efect'!$A$9:$W$40,A8,0)","v":"Gas"}]
[10,"Potencia Instalada MVA",{"$f":"VLOOKUP($C$3,'[11]Potencia Inst y Efect'!$A$9:$W$40,A9,0)","v":14.547500000000001}]
[15,"Potencia Instalada MW",{"$f":"VLOOKUP($C$3,'[11]Potencia Inst y Efect'!$A$9:$W$40,A10,0)","v":11.637999999999998}]
[21,"Potencia a Temp. Media",{"$f":"VLOOKUP($C$3,'[11]Potencia Inst y Efect'!$A$9:$W$40,A11,0)","v":9.56}]
[null,"Consumo especifico (pc/kWh)",{"$f":"SUM(F29:H29)/SUM(F27:H27)","v":10.919685192417695}]
[null,"Consumo especifico (litros/kWh)",0.27718065536918751]
[8,"Energía Alternativa"]
[11,"Potencia Instalada MVA"]
{"$rows_left_out":54}
{"sheet":"Camiri","index":5,"n_rows":106,"n_cols":15,"rows_kept":106,"cut":false,"hidden":false,"merged":[[75,1,75,4],[1,1,1,3],[1,5,1,10],[3,5,4,9],[3,10,4,10],[16,5,16,7],[71,1,74,4]]}
[]
[null,"FICHA TECNICA DEL SISTEMA AISLADO",null,null,null,"PROYECTOS PREVISTOS"]
[null,null,16]
[2,"Departamento",{"$f":"VLOOKUP($C$3,'[11]Potencia Inst y Efect'!$A$9:$W$40,A4,0)","v":"Santa Cruz"},null,null,"Electrificación mediante la extensión de una red (nacional, regional o mini-red)",{"$nulls":4},"X"]
[3,"Provincia",{"$f":"VLOOKUP($C$3,'[11]Potencia Inst y Efect'!$A$9:$W$40,A5,0)","v":"Cordillera"}]
[4,"Sistema Eléctrico",{"$f":"VLOOKUP($C$3,'[11]Potencia Inst y Efect'!$A$9:$W$40,A6,0)","v":"Camiri"}]
[5,"Empresa",{"$f":"VLOOKUP($C$3,'[11]Potencia Inst y Efect'!$A$9:$W$40,A7,0)","v":"CRE Ltda."},null,null,"Proyecto:","Conexión al SIN Camiri"]
[6,"Combustible",{"$f":"VLOOKUP($C$3,'[11]Potencia Inst y Efect'!$A$9:$W$40,A8,0)","v":"Gas"},null,null,"Línea:","115 kV (Padilla - Monteagudo - Camiri)"]
[10,"Potencia Instalada MVA",{"$f":"VLOOKUP($C$3,'[11]Potencia Inst y Efect'!$A$9:$W$40,A9,0)","v":15.83},null,null,null,"Mes/Año de puesta en operación","2021-04-01"]
[15,"Potencia Instalada MW",{"$f":"VLOOKUP($C$3,'[11]Potencia Inst y Efect'!$A$9:$W$40,A10,0)","v":12.673999999999999},null,null,null,"Categoría","Gran Escala"]
[21,"Potencia a Temp. Media",{"$f":"VLOOKUP($C$3,'[11]Potencia Inst y Efect'!$A$9:$W$40,A11,0)","v":11.75},null,null,null,"Metodología Aplicable","AM00045"]
[null,"Consumo especifico (pc/kWh)",{"$f":"SUM(G26:H26)/SUM(G25:H25)","v":9.9920758954998004}]
[8,"Energía Alternativa"]
[11,"Potencia Instalada MVA"]
[16,"Potencia Instalada MW"]
{"$rows_left_out":85}
{"sheet":"German Busch","index":6,"n_rows":60,"n_cols":15,"rows_kept":60,"cut":false,"hidden":false,"merged":[[1,1,1,3],[1,5,1,10],[17,5,17,7]]}
[]
[null,"FICHA TECNICA DEL SISTEMA AISLADO",null,null,null,"PROYECTOS PREVISTOS"]
[null,null,22]
[2,"Departamento",{"$f":"VLOOKUP($C$3,'[11]Potencia Inst y Efect'!$A$9:$W$40,A4,0)","v":"Santa Cruz"},null,null,"NO TIENE PROYECTOS PREVISTOS, SOLO EXPANSION COMB. FOSIL",{"$nulls":4},"X"]
[3,"Provincia",{"$f":"VLOOKUP($C$3,'[11]Potencia Inst y Efect'!$A$9:$W$40,A5,0)","v":"German Bush"}]
[4,"Sistema Eléctrico",{"$f":"VLOOKUP($C$3,'[11]Potencia Inst y Efect'!$A$9:$W$40,A6,0)","v":"German Busch"}]
[5,"Empresa",{"$f":"VLOOKUP($C$3,'[11]Potencia Inst y Efect'!$A$9:$W$40,A7,0)","v":"CRE Ltda."}]
[6,"Combustible",{"$f":"VLOOKUP($C$3,'[11]Potencia Inst y Efect'!$A$9:$W$40,A8,0)","v":"Gas"}]
[10,"Potencia Instalada MVA",{"$f":"VLOOKUP($C$3,'[11]Potencia Inst y Efect'!$A$9:$W$40,A9,0)","v":28.984999999999999}]
[15,"Potencia Instalada MW",{"$f":"VLOOKUP($C$3,'[11]Potencia Inst y Efect'!$A$9:$W$40,A10,0)","v":23.199999999999996}]
[21,"Potencia a Temp. Media",{"$f":"VLOOKUP($C$3,'[11]Potencia Inst y Efect'!$A$9:$W$40,A11,0)","v":19.099999999999998}]
[null,"Consumo especifico (pc/kWh)",{"$f":"SUM(F26:H26)/SUM(F25:H25)","v":13.475068851751542}]
[8,"Energía Alternativa"]
[11,"Potencia Instalada MVA"]
[16,"Potencia Instalada MW"]
{"$rows_left_out":46}
{"sheet":"Bermejo","index":7,"n_rows":105,"n_cols":15,"rows_kept":105,"cut":false,"hidden":false,"merged":[[73,1,73,4],[1,1,1,3],[1,5,1,10],[3,5,4,9],[3,10,4,10],[17,5,17,7],[69,1,72,4]]}
[]
[null,"FICHA TECNICA DEL SISTEMA AISLADO",null,null,null,"PROYECTOS PREVISTOS"]
[null,null,24]
[2,"Departamento",{"$f":"VLOOKUP($C$3,'[11]Potencia Inst y Efect'!$A$9:$W$40,A4,0)","v":"Tarija"},null,null,"Electrificación mediante la extensión de una red (nacional, regional o mini-red)",{"$nulls":4},"X"]
[3,"Provincia",{"$f":"VLOOKUP($C$3,'[11]Potencia Inst y Efect'!$A$9:$W$40,A5,0)","v":"Aniceto Arce"}]
[4,"Sistema Eléctrico",{"$f":"VLOOKUP($C$3,'[11]Potencia Inst y Efect'!$A$9:$W$40,A6,0)","v":"Bermejo"}]
[5,"Empresa",{"$f":"VLOOKUP($C$3,'[11]Potencia Inst y Efect'!$A$9:$W$40,A7,0)","v":"SETAR"},null,null,"Proyecto:","Conexión al SIN Bermejo"]
[6,"Combustible",{"$f":"VLOOKUP($C$3,'[11]Potencia Inst y Efect'!$A$9:$W$40,A8,0)","v":"Gas"},null,null,"Línea:","115 kV (Tarija - Bermejo)"]
[10,"Potencia Instalada MVA",{"$f":"VLOOKUP($C$3,'[11]Potencia Inst y Efect'!$A$9:$W$40,A9,0)","v":18.055999999999997},null,null,null,"Mes/Año de puesta en operación","2021-10-01"]
[15,"Potencia Instalada MW",{"$f":"VLOOKUP($C$3,'[11]Potencia Inst y Efect'!$A$9:$W$40,A10,0)","v":14.443999999999999},null,null,null,"Categoría","Gran Escala"]
[21,"Potencia a Temp. Media",{"$f":"VLOOKUP($C$3,'[11]Potencia Inst y Efect'!$A$9:$W$40,A11,0)","v":11.55},null,null,null,"Metodología Aplicable","AM00045"]
[null,"Consumo especifico (pc/kWh)",{"$f":"SUM(F26:H26)/SUM(F25:H25)","v":13.250152829182118}]
[8,"Energía Alternativa"]
[11,"Potencia Instalada MVA"]
[16,"Potencia Instalada MW"]
{"$rows_left_out":84}
{"sheet":"Chiquitos","index":8,"n_rows":62,"n_cols":15,"rows_kept":62,"cut":false,"hidden":false,"merged":[[1,1,1,3],[1,5,1,10],[16,5,16,7]]}
[]
[null,"FICHA TECNICA DEL SISTEMA AISLADO",null,null,null,"PROYECTOS PREVISTOS"]
[null,null,18]
[2,"Departamento",{"$f":"VLOOKUP($C$3,'[11]Potencia Inst y Efect'!$A$9:$W$40,A4,0)","v":"Santa Cruz"},null,null,"NO TIENE PROYECTOS PREVISTOS, SOLO EXPANSION COMB. FOSIL",{"$nulls":4},"X"]
[3,"Provincia",{"$f":"VLOOKUP($C$3,'[11]Potencia Inst y Efect'!$A$9:$W$40,A5,0)","v":"Chiquitos"}]
[4,"Sistema Eléctrico",{"$f":"VLOOKUP($C$3,'[11]Potencia Inst y Efect'!$A$9:$W$40,A6,0)","v":"Roboré y Santiago de Chiquitos"}]
[5,"Empresa",{"$f":"VLOOKUP($C$3,'[11]Potencia Inst y Efect'!$A$9:$W$40,A7,0)","v":"CRE Ltda."}]
[6,"Combustible",{"$f":"VLOOKUP($C$3,'[11]Potencia Inst y Efect'!$A$9:$W$40,A8,0)","v":"Gas"}]
[10,"Potencia Instalada MVA",{"$f":"VLOOKUP($C$3,'[11]Potencia Inst y Efect'!$A$9:$W$40,A9,0)","v":9.879999999999999}]
[15,"Potencia Instalada MW",{"$f":"VLOOKUP($C$3,'[11]Potencia Inst y Efect'!$A$9:$W$40,A10,0)","v":7.54}]
[21,"Potencia a Temp. Media",{"$f":"VLOOKUP($C$3,'[11]Potencia Inst y Efect'!$A$9:$W$40,A11,0)","v":7.2}]
[null,"Consumo especifico (pc/kWh)",{"$f":"SUM(F26:H26)/SUM(F25:H25)","v":10.919593301706577}]
[8,"Energía Alternativa"]
[11,"Potencia Instalada MVA"]
[16,"Potencia Instalada MW"]
{"$rows_left_out":48}
{"sheet":"Huacaraje","index":9,"n_rows":108,"n_cols":15,"rows_kept":108,"cut":false,"hidden":false,"merged":[[1,1,1,3],[1,5,1,10],[16,5,16,7],[74,1,77,4],[78,1,78,4]]}
[]
[null,"FICHA TECNICA DEL SISTEMA AISLADO",null,null,null,"PROYECTOS PREVISTOS"]
[null,null,12]
[2,"Departamento",{"$f":"VLOOKUP($C$3,'[11]Potencia Inst y Efect'!$A$9:$W$40,A4,0)","v":"Beni"},null,null,"Hibridación/Desplazamiento de energía fósil",{"$nulls":4},"X"]
[3,"Provincia",{"$f":"VLOOKUP($C$3,'[11]Potencia Inst y Efect'!$A$9:$W$40,A5,0)","v":"Itenez"}]
[4,"Sistema Eléctrico",{"$f":"VLOOKUP($C$3,'[11]Potencia Inst y Efect'!$A$9:$W$40,A6,0)","v":"Huacaraje"},null,null,"Proyecto:","Planta Solar Huacaraje"]
[5,"Empresa",{"$f":"VLOOKUP($C$3,'[11]Potencia Inst y Efect'!$A$9:$W$40,A7,0)","v":"ENDE DELBENI S.A.M."},null,null,null,"Potencia Instalada MW",250,"kWp"]
[6,"Combustible",{"$f":"VLOOKUP($C$3,'[11]Potencia Inst y Efect'!$A$9:$W$40,A8,0)","v":"Diesel"},null,null,null,"Potencia a Temp. Media",{"$f":"+H7*0.95","v":237.5},"kWp"]
[10,"Potencia Instalada MVA",{"$f":"VLOOKUP($C$3,'[11]Potencia Inst y Efect'!$A$9:$W$40,A9,0)","v":0.58000000000000007},null,null,null,"Mes/Año de puesta en operación","2021-05-01"]
[15,"Potencia Instalada MW",{"$f":"VLOOKUP($C$3,'[11]Potencia Inst y Efect'!$A$9:$W$40,A10,0)","v":0.46400000000000002},null,null,null,"Factor de Planta",0.13736980593607304]
[21,"Potencia a Temp. Media",{"$f":"VLOOKUP($C$3,'[11]Potencia Inst y Efect'!$A$9:$W$40,A11,0)","v":0.39800000000000002},null,null,null,"Categoría","Pequeña Escala"]
[null,"Consumo especifico (lts/kWh)",{"$f":"SUM(H26)/SUM(H25)","v":0.31256699756248457},null,null,null,"Metodología Aplicable","AMS I.A"]
[8,"Energía Alternativa"]
[11,"Potencia Instalada MVA"]
[16,"Potencia Instalada MW"]
{"$rows_left_out":86}
{"sheet":"Rosario del Yata","index":10,"n_rows":64,"n_cols":23,"rows_kept":64,"cut":false,"hidden":false,"merged":[[1,1,1,3],[1,5,1,10],[2,18,2,22],[7,18,7,19],[16,5,16,7]]}
[]
[null,"FICHA TECNICA DEL SISTEMA AISLADO",null,null,null,"PROYECTOS PREVISTOS"]
[null,null,8,{"$nulls":15},"IPPC - DATA"]
[2,"Departamento",{"$f":"VLOOKUP($C$3,'[11]Potencia Inst y Efect'!$A$9:$W$40,A4,0)","v":"Beni"},null,null,"NO TIENE PROYECTOS PREVISTOS, SOLO EXPANSION COMB. FOSIL",{"$nulls":4},"X",{"$nulls":7},"EFCO2,GAS",5.4300000000000001E-2,"tCO2/GJ","kgCO2/MJ","Source for Gas EF - IPCC 2006 (Lower value)"]
[3,"Provincia",{"$f":"VLOOKUP($C$3,'[11]Potencia Inst y Efect'!$A$9:$W$40,A5,0)","v":"Vaca Diez"},{"$nulls":15},"EFCO2,DIESEL",7.2599999999999998E-2,"tCO2/GJ","kgCO2/MJ","Source for Diesel EF - IPCC 2006 (Lower value)"]
[4,"Sistema Eléctrico",{"$f":"VLOOKUP($C$3,'[11]Potencia Inst y Efect'!$A$9:$W$40,A6,0)","v":"Rosario del Yata"},{"$nulls":17},"Value","Units"]
[5,"Empresa",{"$f":"VLOOKUP($C$3,'[11]Potencia Inst y Efect'!$A$9:$W$40,A7,0)","v":"ENDE DELBENI S.A.M."},{"$nulls":17},1.05506E-3,"MJ/Btu"]
[6,"Combustible",{"$f":"VLOOKUP($C$3,'[11]Potencia Inst y Efect'!$A$9:$W$40,A8,0)","v":"Diesel"},{"$nulls":15},"Conversion factors",null,1.05506E-6,"GJ/Btu"]
[10,"Potencia Instalada MVA",{"$f":"VLOOKUP($C$3,'[11]Potencia Inst y Efect'!$A$9:$W$40,A9,0)","v":1.2080000000000002}]
[15,"Potencia Instalada MW",{"$f":"VLOOKUP($C$3,'[11]Potencia Inst y Efect'!$A$9:$W$40,A10,0)","v":0.96640000000000004},{"$nulls":15},"Emission Factors"]
[21,"Potencia a Temp. Media",{"$f":"VLOOKUP($C$3,'[11]Potencia Inst y Efect'!$A$9:$W$40,A11,0)","v":0.77312000000000014},{"$nulls":16},"CO2 Emissions Factor Natural Gas",{"$f":"T4*1000000","v":54300},"gCO2/GJ"]
[null,"Consumo especifico (lts/kWh)",{"$f":"SUM(G26:H26)/SUM(G25:H25)","v":0.45269186812040735},{"$nulls":16},"CO2 Emissions Factor Natural Gas (g/BTU)",{"$f":"U11*U8","v":5.7289758000000003E-2},"gCO2/BTU"]
[8,"Energía Alternativa"]
[11,"Potencia Instalada MVA",{"$nulls":17},"CO2 Emissions Factor Natural Diesel",{"$f":"T5*1000000","v":72600},"gCO2/GJ"]
[16,"Potencia Instalada MW",{"$nulls":17},"CO2 Emissions Factor Diesel (g/BTU)",{"$f":"U14*U8","v":7.6597356000000005E-2},"gCO2/BTU"]
{"$rows_left_out":50}
{"sheet":"El Sena","index":11,"n_rows":65,"n_cols":15,"rows_kept":65,"cut":false,"hidden":false,"merged":[[1,1,1,3],[1,5,1,10],[17,5,17,7]]}
[]
[null,"FICHA TECNICA DEL SISTEMA AISLADO",null,null,null,"PROYECTOS POREVISTOS"]
[null,null,2,"S2"]
[2,"Departamento",{"$f":"VLOOKUP($C$3,'[11]Potencia Inst y Efect'!$A$9:$W$40,A4,0)","v":"Pando"},null,null,"NO TIENE PROYECTOS PREVISTOS, SOLO EXPANSION COMB. FOSIL",{"$nulls":4},"X"]
[3,"Provincia",{"$f":"VLOOKUP($C$3,'[11]Potencia Inst y Efect'!$A$9:$W$40,A5,0)","v":"Madre de Dios"},{"$nulls":10}," "]
[4,"Sistema Electrico",{"$f":"VLOOKUP($C$3,'[11]Potencia Inst y Efect'!$A$9:$W$40,A6,0)","v":"El Sena"}]
[5,"Empresa",{"$f":"VLOOKUP($C$3,'[11]Potencia Inst y Efect'!$A$9:$W$40,A7,0)","v":"ENDE"}]
[6,"Combustible",{"$f":"VLOOKUP($C$3,'[11]Potencia Inst y Efect'!$A$9:$W$40,A8,0)","v":"Diesel"}]
[10,"Potencia Instalada MVA",{"$f":"VLOOKUP($C$3,'[11]Potencia Inst y Efect'!$A$9:$W$40,A9,0)","v":2.7669999999999999}]
[15,"Potencia Instalada MW",{"$f":"VLOOKUP($C$3,'[11]Potencia Inst y Efect'!$A$9:$W$40,A10,0)","v":2.2160000000000002}]
[21,"Potencia a Temp. Media",{"$f":"VLOOKUP($C$3,'[11]Potencia Inst y Efect'!$A$9:$W$40,A11,0)","v":1.2999999999999998}]
[null,"Consumo especifico (lts/kWh)",{"$f":"SUM(F27:H27)/SUM(F26:H26)","v":0.31205778586083632}]
[8,"Energia Alternativa",null,"Solar(*)"]
[11,"Potencia Instalada MVA",null,{"$f":"VLOOKUP($D$3,'[11]Potencia Inst y Efect'!$A$9:$W$40,A14,0)","v":0.4}]
[16,"Potencia Instalada MW",null,{"$f":"VLOOKUP($D$3,'[11]Potencia Inst y Efect'!$A$9:$W$40,A15,0)","v":0.4}]
{"$rows_left_out":51}
{"sheet":"DESCRIPCION 6","index":12,"n_rows":29,"n_cols":6,"rows_kept":29,"cut":false,"hidden":false,"merged":[[2,1,2,4],[3,1,3,4]]}
[]
[]
[null,"Demanda Máxima (kW) y Número de Consumidores de los sistemas Aislados"]
[null,"Gestión 2018"]
[null,"Empresa \nEléctrica","Sistema","Demanda \nMáxima (kW)","Número de \nConsumidores","Combustible"]
[null,"ENDE","Cobija",12360,17092,"Diesel"]
[null,null,"El Sena",673,976,"Diesel"]
[null,null,"Guayaramerín",5140,9030,"Diesel"]
[null,null,"Cachuela Esperanza",47,148,"Diesel"]
[null,null,"Rosario del Yata",48,148,"Diesel"]
[null,null,"Puerto Ustarez",8.91,38,"Diesel"]
[null,"ENDE DELBENI S.A.M.","Baures",210,953,"Diesel"]
[null,null,"Bella Vista",202,702,"Diesel"]
[null,null,"Huacaraje",159,505,"Diesel"]
[null,null,"El Carmen de Itenez",77.3,218,"Diesel"]
{"$rows_left_out":15}
{"sheet":"CAP VI-1","index":13,"n_rows":66,"n_cols":20,"rows_kept":66,"cut":false,"hidden":false,"merged":[[60,2,60,3],[6,4,6,7],[6,9,6,12],[6,15,6,18],[2,1,2,18],[3,1,3,18],[5,4,5,12],[5,14,5,18]]}
[]
[]
[null,"Potencia instalada y efectiva al 31 de diciembre de 2018"]
[]
[]
[{"$nulls":4},"Potencia Instalada",{"$nulls":9},"Potencia Efectiva a Temp. media"]
[null,null,"Empresa","Central","(MVA)",{"$nulls":4},"(MW)",{"$nulls":4},"°C","(MW)"]
[{"$nulls":4},"Hidro","Termo","E. Alternativas","Total",null,"Hidro","Termo","E. Alternativas","Total",null,null,"Hidro","Termo","E. Alternativas","Total"]
[null,null,"GENERACIÓN - DISTRIBUCIÓN"]
[null,null,"ENDE","Cobija",null,28.199999999999996,null,{"$f":"SUM(E10:G10)","v":28.199999999999996},null,null,22.560000000000002,null,{"$f":"SUM(J10:L10)","v":22.560000000000002},null,"40°",null,19.500000000000004,null,{"$f":"SUM(P10:R10)","v":19.500000000000004},{"$f":"S10","v":19.500000000000004}]
[null,null,null,"El Sena",null,2.7669999999999999,null,2.7669999999999999,null,null,2.2160000000000002,null,2.2160000000000002,null,"40°",null,1.2999999999999998,null,{"$f":"SUM(P11:R11)","v":1.2999999999999998},{"$f":"S11","v":1.2999999999999998}]
[null,null,null,"Guayaramerín",null,22.349999999999994,null,22.349999999999994,null,null,17.254999999999995,null,17.254999999999995,null,"36°",null,15.446000000000002,null,{"$f":"SUM(P12:R12)","v":15.446000000000002},15.446000000000002]
[null,null,null,"Cachuela Esperanza",null,0.80899999999999994,null,0.80899999999999994,null,null,0.64700000000000002,null,0.64700000000000002,null,"36°",null,0.51760000000000006,null,{"$f":"SUM(P13:R13)","v":0.51760000000000006},0.51760000000000006]
[null,null,null,"Rosario del Yata",null,1.2080000000000002,null,1.2080000000000002,null,null,0.96640000000000004,null,0.96640000000000004,null,"36°",null,0.77312000000000014,null,0.77312000000000014,0.77312000000000014]
[null,null,null,"Puerto Ustárez",null,0.23499999999999999,null,0.23499999999999999,null,null,0.188,null,0.188,null,"34°",null,0.14100000000000001,null,0.14100000000000001,0.14100000000000001]
{"$rows_left_out":52}
{"sheet":"Generacion Bruta","index":14,"n_rows":40,"n_cols":9,"rows_kept":40,"cut":false,"hidden":false,"merged":[[1,1,1,8],[2,1,2,8]]}
[]
[null,"Evolución de la generación bruta (GWh)"]
[null,"Periodo 1996-2018"]
[]
[null,"Empresa",null,"Central/Sistema",2014,2015,2016,2017,2018]
[]
[null,"Fotovoltaica"]
[null,"ENDE GUARACAHI S.A.",null,"Cobija",0,4.7943755010909097,5.6278183999999989,5.7761255999999994,{"$f":"'[12]CAP VI-5'!O7","v":5.3198761000000019}]
[null,"CRE R.L.",null,"El Espino",0,0,3.8451240000000005E-2,4.8443E-2,{"$f":"'[12]CAP VI-5'!O8","v":4.8871999999999999E-2}]
[null,"Total Generación Fotovoltaíca",null,null,0,{"$f":"+F8","v":4.7943755010909097},{"$f":"SUM(G8:G9)","v":5.6662696399999986},5.8245685999999992,{"$f":"SUM(I8:I9)","v":5.3687481000000021}]
[null,"Termoeléctrica"]
[null,"SETAR"]
[null,null," ","Bermejo",17.625435,24.367993999999999,25.069997999999998,27.032792000000004,{"$f":"'[12]CAP VI-5'!O30","v":28.138757000000002}]
[null,null,null,"Entre Ríos",4.6918300000000004,5.9633520000000004,6.8269659999999996,7.2175999999999991,{"$f":"'[12]CAP VI-5'!O31","v":7.5071260000000004}]
[null,null,null,"El Puente",0.80841999999999992,0,0,0,0]
{"$rows_left_out":26}
{"sheet":"Hoja1","index":15,"n_rows":0,"n_cols":0,"rows_kept":0,"cut":false,"hidden":false,"merged":[]}