{"text_format":"2","workbook":"xlsx","n_sheets":10,"sheets":["Read Me","Quick Check","Questionaire","Review","Summary","12-Month Cash Flow","10-Year Cash Flow","Energy Calculation","1st Loan Repayment","2nd Loan Repayment"],"not_rendered":{"charts":7,"images":12,"macros":0,"external_links":0,"defined_names":183,"comments":0,"pivot_tables":0},"unopened":[],"bounds":{"document_bytes":16777216,"sheet_cells":100000,"run_cost":"one","rows_first":2000,"rows_last":500,"rows_between":2000,"halvings":0,"cell_chars":16384,"cell_head_chars":4096},"cells_cut":0,"cells_raw":0,"read":"whole","date_system":"1900"}

{"sheet":"Read Me","index":0,"n_rows":29,"n_cols":3,"rows_kept":29,"cut":false,"hidden":false,"merged":[[28,1,28,8],[8,1,8,8],[0,0,0,8],[2,0,2,8],[4,0,4,8],[6,1,6,8],[7,1,7,8],[21,2,21,8],[9,1,9,8],[10,1,10,8],[12,1,12,8],[13,2,13,8],[14,2,14,8],[15,2,15,8],[16,2,16,8],[17,2,17,8],[18,2,18,8],[19,2,19,8],[20,2,20,8],[22,2,22,8],[24,1,24,8],[25,1,25,8],[26,1,26,8],[27,1,27,8]]}
["Read Me Sheet"]
[]
["PUE Mini Business Plan Calculator"]
[]
["This spreadsheet tool is a supplement to the \"Photovoltaics for Productive Use Applications: A Catalogue of DC-Appliances\" (GIZ HERA, 2015). This tool is designed for use by field facilitators, business development advisors, business mentors, technology suppliers and other practitioners in the field of rural development."]
[]
["Objective:","To determine the core financial performance of a business idea or concept, using solar PV technology, during the planning phase and during periodic performance evaluations"]
["Version:","1.0 (Dec 2015)"]
["Authors:","Robert Schultz"]
[null,"Caspar Priesemann"]
["Download link:","https://energypedia.info/wiki/File:PUE_Mini_Business_Plan_Calculator.xlsx"]
[]
["Instructions:","The tool comprises a total of 10 sheets:"]
[null,"Read Me","to serve as introduction and provide instructions"]
[null,"Quick Check","Basic data entry! To conduct a basic financial performance evaluation of a business idea"]
{"$rows_left_out":15}
{"sheet":"Quick Check","index":1,"n_rows":34,"n_cols":4,"rows_kept":34,"cut":false,"hidden":false,"merged":[[0,0,0,3],[1,0,1,3]]}
["Quick Check Sheet"]
["This Quick Check Sheet serves as a very first rough assessment on whether your business idea is potentially successful. values need only be estimates. Business planning requires clear thinking. Therefore, if this Quick Check sheet gives a positive result, please proceed to the more detailed Questionnaire Sheet. "]
[null,null,"Value","Unit"]
["A","INCOME"]
["A.1","Unit price of main product sold",0,"$/unit"]
["A.2","Quantity of main product sold per month",0,"qty"]
["A.3","Value of any other products or services sold per month",0,"$/month"]
[null,"Estimated income per month:",{"$f":"(C5*C6)+C7","v":0},"$/month"]
["B","EXPENDITURE"]
["B.1","Monthly fixed costs (salaries, rent, bank loan, etc)",0,"$/month"]
["B.2","Monthly variable costs (materials, consumables, etc)",0,"$/month"]
["B.3","Any other monthly expenses",0,"$/month"]
[null,"Estimated expenditure per month:",{"$f":"SUM(C10:C12)","v":0},"$/month"]
["C","START-UP"]
["C.1","Once-off start-up expenses (building renovations, registration fees, etc)",0,"$"]
{"$rows_left_out":20}
{"sheet":"Questionaire","index":2,"n_rows":115,"n_cols":8,"rows_kept":115,"cut":false,"hidden":false,"merged":[[81,0,82,2],[97,0,97,2],[88,1,88,6],[89,1,89,6],[78,2,78,3],[70,2,70,3],[74,2,74,3],[75,2,75,3],[76,2,76,3],[77,2,77,3],[62,2,62,3],[66,2,66,3],[67,2,67,3],[68,2,68,3],[69,2,69,3],[54,2,54,3],[58,2,58,3],[59,2,59,3],[60,2,60,3],[61,2,61,3],[20,1,21,2],[50,2,50,3],[51,2,51,3],[52,2,52,3],[53,2,53,3],[27,2,27,3],[28,2,28,3],[29,2,29,3],[30,2,30,3],[0,1,0,7],[1,0,1,7],[14,7,17,7],[13,2,13,4],[14,2,14,4],[4,4,4,5],[5,4,5,5],[6,4,6,5],[7,4,7,5],[8,4,8,5],[9,4,9,5],[10,4,10,5]]}
[null,"Questionnaire Sheet"]
["To consider whether your business idea has prospects for success, several key questions need to be answered. Please look at the below and answer the questions one at a time. Do not feel overwhelmed, but simply take it step by step. This questionnaire allows you to think about your future business in a systematic way so that you can make an informed decision and avoid common pitfalls."]
[null,"Questions",null,null,null,"Value","Unit","Hints"]
["A","Your business identity"]
["A.1","What is the name of your (new) business?",{"$nulls":4},"text"]
["A.2","What is the main products that you will be selling?",{"$nulls":4},"text","e.g. furniture, chickens, clothes, milk, general groceries"]
["A.3","What is the main services you will be selling?",{"$nulls":4},"text","e.g. hair cutting, phone charging, construction, maintenance"]
["A.4","What will be the essential input materials you need to buy for your business?",{"$nulls":4},"text","Without these materials (e.g. wood, cloth, eggs) your business cannot produce anything "]
["A.5","What will be the optional input materials you need to buy for your business?",{"$nulls":4},"text","With these materials you can produce better quality products, but they are not essential"]
["A.6","What will be the essential consumables you need to buy for your business?",{"$nulls":4},"text","Without these materials (e.g. nails, glue, yarn, needles, chick feed, paper, printer cartridges) your business cannot produce anything."]
["A.7","What will be the optional consumables you need to buy for your business?",{"$nulls":4},"text","With these materials you can produce better quality products, but they are not essential"]
[]
["B","Your business income"]
[null,"Your are selling the product:",{"$f":"E6","v":0}]
[null,"Your are selling the service:",{"$f":"E7","v":0},{"$nulls":4},"Using your best judgement, consider how much income you can make. This is total income before any expenses. Please think about the maximum, average and lowest income possible in the market that you serve and for the size of your future business. If unsure make a guess and the tool will assist in showing whether your guessed income will be sufficient."]
{"$rows_left_out":101}
{"sheet":"Review","index":3,"n_rows":39,"n_cols":6,"rows_kept":39,"cut":false,"hidden":false,"merged":[[0,1,0,5],[1,0,1,5]]}
[null,"Review Sheet"]
["This Review Sheet gives you an overview of the general technical and financial aspects of your future business. The results in this review can be changed by re-entering values in the Questionnaire Sheet."]
[null,"Name of business:",null,{"$f":"Questionaire!$E$5","v":0}]
[null,"Type of main products:",null,{"$f":"Questionaire!$E$6","v":0}]
[null,"Type of main services:",null,{"$f":"Questionaire!$E$7","v":0}]
[null,"Technical and Financial Aspects",null,"Value","Unit","Sensitive to:"]
["B","Your business income"]
[null,{"$f":"Questionaire!$E$16","v":"Scenario: Strong"},null,{"$f":"Questionaire!$F$16","v":0},"$/month","If your market is strong, your product and service in high demand. But markets change!"]
[null,{"$f":"Questionaire!$E$17","v":"Scenario: Stable"},null,{"$f":"Questionaire!$F$17","v":0},"$/month","If your market is stable and your product and service is in regular demand. But markets change!"]
[null,{"$f":"Questionaire!$E$18","v":"Scenario: Weak"},null,{"$f":"Questionaire!$F$18","v":0},"$/month","If your market is weak and there is low demand for your product and service. But markets change!"]
[]
["C","Your business expenditure"]
[null,"Total start-up expenses (excluding equipment)",null,{"$f":"SUM(Questionaire!$F$22:$F$26)","v":0},"$"]
[null,"Total monthly material and consumables expenses:",null,{"$f":"SUM(Questionaire!$F$28:$F$31)","v":0},"$/month"]
[null,"Total recurring monthly regular expenses:",null,{"$f":"SUM(Questionaire!$F$33:$F$45)","v":0},"$/month"]
{"$rows_left_out":25}
{"sheet":"Summary","index":4,"n_rows":30,"n_cols":8,"rows_kept":30,"cut":false,"hidden":false,"merged":[[21,1,21,2],[22,1,22,2],[23,1,23,2],[0,1,0,8],[20,1,20,2],[3,3,3,5],[4,3,4,5],[5,3,5,5],[6,3,6,5],[15,1,15,2],[16,1,16,2],[7,3,7,5],[8,3,8,5],[11,3,11,5],[12,3,12,5],[13,3,13,5],[8,1,8,2],[11,1,11,2],[12,1,12,2],[13,1,13,2],[14,1,14,2],[3,1,3,2],[4,1,4,2],[5,1,5,2],[6,1,6,2],[7,1,7,2],[26,7,29,8],[14,3,14,5],[15,3,15,5],[16,3,16,5],[17,3,17,5],[24,7,24,8],[10,7,10,8],[6,7,6,8],[8,7,8,8],[16,7,16,8],[23,7,23,8],[7,7,7,8],[11,7,11,8],[12,7,12,8],[13,7,13,8],[14,7,14,8],[15,7,15,8],[17,7,17,8],[19,7,19,8],[20,7,20,8],[21,7,21,8],[22,7,22,8],[1,3,1,5],[5,7,5,8],[4,7,4,8],[3,7,3,8],[2,7,2,8]]}
[null,"Summary Sheet"]
[null,null,null,"Value",null,null,"Unit","Notes"]
[null,"Basic information"]
[null,"Name of business:",null,{"$f":"Questionaire!$E$5","v":0},null,null,"text"]
[null,"Type of main products:",null,{"$f":"Questionaire!$E$6","v":0},null,null,"text"]
[null,"Type of main services:",null,{"$f":"Questionaire!$E$7","v":0},null,null,"text"]
[null,"Total investment costs for assets",null,{"$f":"D12+D13","v":0},null,null,"$","includes all appliances and PV system"]
[null,"Total own funding or grant funding available:",null,{"$f":"Questionaire!$F$100+Questionaire!$F$101","v":0},null,null,"$"]
[null,"Total amount borrowed from bank(s)",null,{"$f":"Questionaire!$F$104+Questionaire!$F$111","v":0},null,null,"$","if RED: This value is too low to start your business"]
[]
[null,"Start-up investment and expenses"]
[null,"Cost of all electric appliances:",null,{"$f":"(Questionaire!$F$51*Questionaire!$F$55)+(Questionaire!$F$59*Questionaire!$F$63)+(Questionaire!$F$67*Questionaire!$F$71)+(Questionaire!$F$75*Questionaire!$F$79)","v":0},null,null,"$"]
[null,"Cost of PV system:",null,{"$f":"Questionaire!$F$86","v":0},null,null,"$"]
[null,"Cost of input materials and consumables:",null,{"$f":"SUM('12-Month Cash Flow'!$C$14:$C$15)","v":0},null,null,"$"]
[null,"Bank loan deposits required:",null,{"$f":"(Questionaire!$F$104*Questionaire!$F$107)+(Questionaire!$F$111*Questionaire!$F$114)","v":0},null,null,"$"]
{"$rows_left_out":16}
{"sheet":"12-Month Cash Flow","index":5,"n_rows":109,"n_cols":17,"rows_kept":109,"cut":false,"hidden":false,"merged":[[86,3,86,14],[0,1,0,16],[37,1,37,16],[74,1,74,16],[12,3,12,14],[49,3,49,14]]}
[null,"12-Month Cash Flow"]
[null,{"$f":"Questionaire!E16","v":"Scenario: Strong"},"Company name:",null,{"$f":"Questionaire!$E$5","v":0},{"$nulls":4},"Fiscal Year Begins:",{"$f":"Questionaire!$F$108","v":"00:00:00"}]
[null,null,"Start-up",{"$f":"K2","v":"00:00:00"},{"$f":"DATE(YEAR(D3),MONTH(D3)+1,1)","v":"1900-02-01"},{"$f":"DATE(YEAR(E3),MONTH(E3)+1,1)","v":"1900-03-01"},"1900-04-01","1900-05-01","1900-06-01","1900-07-01","1900-08-01","1900-09-01","1900-10-01","1900-11-01","1900-12-01","Year 1","Year 2"]
[null,"STRONG: CASH AVAILABLE (beginning of month)",{"$f":"Questionaire!$F$100+Questionaire!$F$101","v":0},{"$f":"C35","v":0},0,0,0,0,0,0,0,0,0,0,0,null,{"$f":"O35","v":0}]
[]
[null,"CASH RECEIPTS"]
[null,"Cash Sales",null,{"$f":"Questionaire!$F$16","v":0},{"$f":"Questionaire!$F$16","v":0},{"$f":"Questionaire!$F$16","v":0},{"$f":"Questionaire!$F$16","v":0},{"$f":"Questionaire!$F$16","v":0},{"$f":"Questionaire!$F$16","v":0},{"$f":"Questionaire!$F$16","v":0},{"$f":"Questionaire!$F$16","v":0},{"$f":"Questionaire!$F$16","v":0},{"$f":"Questionaire!$F$16","v":0},{"$f":"Questionaire!$F$16","v":0},{"$f":"Questionaire!$F$16","v":0},{"$f":"SUM(D7:O7)","v":0},{"$f":"SUM(D7:O7)","v":0}]
[null,"Other Sales"]
[null,"TOTAL CASH RECEIPTS",{"$f":"SUM(C7:C7)","v":0},0,0,0,0,0,0,0,0,0,0,0,0,0,0]
[null,"Total Cash Available (before cash out)",{"$f":"(C4+C9)","v":0},0,0,0,0,0,0,0,0,0,0,0,0,null,{"$f":"(Q4+Q9)","v":0}]
[]
[null,"CASH PAID OUT"]
[null,"start-up expense",{"$f":"SUM(Questionaire!$F$22:$F$26)","v":0},0,{"$nulls":11},{"$f":"SUM(C13:O13)","v":0},0]
[null,"input materials",{"$f":"Questionaire!$F$28+Questionaire!$F$29","v":0},{"$f":"C14","v":0},{"$f":"D14","v":0},0,0,0,0,0,0,0,0,0,0,{"$f":"SUM(C14:O14)","v":0},{"$f":"P14+(P14*Questionaire!$F$47)","v":0}]
[null,"consumables",{"$f":"Questionaire!$F$30+Questionaire!$F$31","v":0},{"$f":"C15","v":0},0,0,0,0,0,0,0,0,0,0,0,{"$f":"SUM(C15:O15)","v":0},{"$f":"P15+(P15*Questionaire!$F$47)","v":0}]
{"$rows_left_out":95}
{"sheet":"10-Year Cash Flow","index":6,"n_rows":107,"n_cols":14,"rows_kept":107,"cut":false,"hidden":false,"merged":[[84,3,84,12],[0,1,0,13],[36,1,36,13],[72,1,72,13],[12,3,12,12],[48,3,48,12]]}
[null,"10-Year Cash Flow"]
[null,{"$f":"Questionaire!E16","v":"Scenario: Strong"},"Company name:",null,{"$f":"Questionaire!$E$5","v":0},{"$nulls":4},"Fiscal Year Begins:",{"$f":"Questionaire!$F$108","v":"00:00:00"}]
[null,null,"Year 1","Year 2","Year 3","Year 4","Year 5","Year 6","Year 7","Year 8","Year 9","Year 10","Year 11","Year 12"]
[null,"STRONG: CASH AVAILABLE (beginning of year)",{"$f":"Questionaire!$F$100+Questionaire!$F$101","v":0},{"$f":"C35","v":0},{"$f":"D35","v":0},{"$f":"E35","v":0},{"$f":"F35","v":0},0,0,0,0,0,0,0]
[]
[null,"CASH RECEIPTS"]
[null,"Cash Sales",{"$f":"'12-Month Cash Flow'!Q9","v":0},{"$f":"C7","v":0},{"$f":"D7","v":0},{"$f":"E7","v":0},{"$f":"F7","v":0},{"$f":"G7","v":0},0,0,0,0,0]
[null,"Other Sales"]
[null,"TOTAL CASH RECEIPTS",{"$f":"SUM(C7:C7)","v":0},0,0,0,0,0,0,0,0,0,0]
[null,"Total Cash Available (before cash out)",{"$f":"(C4+C9)","v":0},{"$f":"(D4+D9)","v":0},{"$f":"(E4+E9)","v":0},{"$f":"(F4+F9)","v":0},{"$f":"(G4+G9)","v":0},{"$f":"(H4+H9)","v":0},0,0,0,0,0]
[]
[null,"CASH PAID OUT"]
[null,"start-up expense",{"$f":"'12-Month Cash Flow'!$P$13","v":0},0]
[null,"input materials",{"$f":"'12-Month Cash Flow'!$P$14","v":0},{"$f":"C14+(C14*Questionaire!$F$47)","v":0},{"$f":"D14+(D14*Questionaire!$F$47)","v":0},{"$f":"E14+(E14*Questionaire!$F$47)","v":0},{"$f":"F14+(F14*Questionaire!$F$47)","v":0},{"$f":"G14+(G14*Questionaire!$F$47)","v":0},{"$f":"H14+(H14*Questionaire!$F$47)","v":0},{"$f":"I14+(I14*Questionaire!$F$47)","v":0},{"$f":"J14+(J14*Questionaire!$F$47)","v":0},{"$f":"K14+(K14*Questionaire!$F$47)","v":0},{"$f":"L14+(L14*Questionaire!$F$47)","v":0}]
[null,"consumables",{"$f":"'12-Month Cash Flow'!$P$15","v":0},{"$f":"C15+(C15*Questionaire!$F$47)","v":0},{"$f":"D15+(D15*Questionaire!$F$47)","v":0},{"$f":"E15+(E15*Questionaire!$F$47)","v":0},{"$f":"F15+(F15*Questionaire!$F$47)","v":0},{"$f":"G15+(G15*Questionaire!$F$47)","v":0},{"$f":"H15+(H15*Questionaire!$F$47)","v":0},{"$f":"I15+(I15*Questionaire!$F$47)","v":0},{"$f":"J15+(J15*Questionaire!$F$47)","v":0},{"$f":"K15+(K15*Questionaire!$F$47)","v":0},{"$f":"L15+(L15*Questionaire!$F$47)","v":0}]
{"$rows_left_out":93}
{"sheet":"Energy Calculation","index":7,"n_rows":27,"n_cols":38,"rows_kept":27,"cut":false,"hidden":false,"merged":[[0,0,0,7],[21,0,21,5]]}
["Energy calculation"]
[]
["Type of appliance","Wattage (W)","Qty","Hrs/day","AC?","Wh/day"]
[{"$f":"Questionaire!F50","v":0},{"$f":"Questionaire!F52","v":0},{"$f":"Questionaire!F55","v":0},{"$f":"Questionaire!F54","v":0},{"$f":"IF(Questionaire!F53=\"AC\",\"AC\",\"\")","v":""},{"$f":"(B4*C4*D4)","v":0}]
[{"$f":"Questionaire!F58","v":0},{"$f":"Questionaire!F60","v":0},{"$f":"Questionaire!F63","v":0},{"$f":"Questionaire!F62","v":0},{"$f":"IF(Questionaire!F61=\"AC\",\"AC\",\"\")","v":""},{"$f":"(B5*C5*D5)","v":0}]
[{"$f":"Questionaire!F66","v":0},{"$f":"Questionaire!F68","v":0},{"$f":"Questionaire!F71","v":0},{"$f":"Questionaire!F70","v":0},{"$f":"IF(Questionaire!F69=\"AC\",\"AC\",\"\")","v":""},{"$f":"(B6*C6*D6)","v":0}]
[{"$f":"Questionaire!F74","v":0},{"$f":"Questionaire!F76","v":0},{"$f":"Questionaire!F79","v":0},{"$f":"Questionaire!F78","v":0},{"$f":"IF(Questionaire!F77=\"AC\",\"AC\",\"\")","v":""},{"$f":"(B7*C7*D7)","v":0}]
["Total:",{"$f":"SUM(B4:B7)","v":0},{"$f":"SUM(C4:C7)","v":0},0,null,{"$f":"SUM(F4:F7)","v":0}]
["Full sunshine hours per day:",{"$f":"Questionaire!$G$83","v":5},"hrs/day"]
["System losses",0.2,"%"]
["PV module capacity required:",{"$f":"(B15/B9)+((B15/B9)*B10)","v":0},"Wp"]
["Inverter?",{"$f":"IF(COUNTIF(E4:E7,\"AC\"),\"Yes\",\"No\")","v":"No"}]
["Days of Autonomy:",{"$f":"Questionaire!F85","v":1}]
["Depth of Discharge:",0.6,"%"]
["Energy storage:",{"$f":"((F8*B13)+((F8*B13)/B14))","v":0},"Wh"]
{"$rows_left_out":13}
{"sheet":"1st Loan Repayment","index":8,"n_rows":374,"n_cols":10,"rows_kept":374,"cut":false,"hidden":false,"merged":[[3,1,3,3],[3,5,3,7],[0,0,0,9]]}
["1st Loan Repayment"]
["Bank:",{"$f":"Questionaire!F103","v":0}]
[]
[null,"Enter Values",null,null,null,"Loan Summary"]
[null,null,"Loan Amount",{"$f":"E5","v":0},{"$f":"Questionaire!$F$104","v":0},null,"Scheduled Payment",{"$f":"IF(Values_Entered,-PMT(Interest_Rate/Num_Pmt_Per_Year,Loan_Years*Num_Pmt_Per_Year,Loan_Amount),\"0\")","v":"0"}]
[null,null,"Annual Interest Rate",{"$f":"E6","v":0},{"$f":"Questionaire!$F$105","v":0},null,"Scheduled Number of Payments",{"$f":"IF(Values_Entered,Loan_Years*Num_Pmt_Per_Year,\"\")","v":""}]
[null,null,"Loan Period in Years",{"$f":"E7","v":0},{"$f":"Questionaire!$F$106","v":0},null,"Actual Number of Payments",{"$f":"IF(Values_Entered,Number_of_Payments,\"\")","v":""}]
[null,null,"Number of Payments Per Year",12,null,null,"Total Early Payments",{"$f":"IF(Values_Entered,SUMIF(Beg_Bal,\">0\",Extra_Pay),\"\")","v":""}]
[null,null,"Start Date of Loan",{"$f":"E9","v":"00:00:00"},{"$f":"Questionaire!F108","v":"00:00:00"},null,"Total Interest",{"$f":"IF(Values_Entered,SUMIF(Beg_Bal,\">0\",Int),\"\")","v":""}]
[null,null,"Optional Extra Payments",0]
[]
[]
["PmtNo.","Payment Date","Beginning Balance","Scheduled Payment","Extra Payment","Total Payment","Principal","Interest","Ending Balance","Cumulative Interest"]
[]
[{"$f":"IF(Values_Entered,1,\"\")","v":""},{"$f":"IF(Pay_Num<>\"\",DATE(YEAR(Loan_Start),MONTH(Loan_Start)+(Pay_Num)*12/Num_Pmt_Per_Year,DAY(Loan_Start)),\"\")","v":""},{"$f":"IF(Values_Entered,Loan_Amount,\"\")","v":""},{"$f":"IF(Pay_Num<>\"\",Scheduled_Monthly_Payment,\"\")","v":""},{"$f":"IF(AND(Pay_Num<>\"\",Sched_Pay+Scheduled_Extra_Payments<Beg_Bal),Scheduled_Extra_Payments,IF(AND(Pay_Num<>\"\",Beg_Bal-Sched_Pay>0),Beg_Bal-Sched_Pay,IF(Pay_Num<>\"\",0,\"\")))","v":{"$error":"#VALUE!"}},{"$f":"IF(AND(Pay_Num<>\"\",Sched_Pay+Extra_Pay<Beg_Bal),Sched_Pay+Extra_Pay,IF(Pay_Num<>\"\",Beg_Bal,\"\"))","v":{"$error":"#VALUE!"}},{"$f":"IF(Pay_Num<>\"\",Total_Pay-Int,\"\")","v":""},{"$f":"IF(Pay_Num<>\"\",Beg_Bal*(Interest_Rate/Num_Pmt_Per_Year),\"\")","v":""},{"$f":"IF(AND(Pay_Num<>\"\",Sched_Pay+Extra_Pay<Beg_Bal),Beg_Bal-Princ,IF(Pay_Num<>\"\",0,\"\"))","v":{"$error":"#VALUE!"}},{"$f":"SUM($H$15:$H15)","v":0}]
{"$rows_left_out":360}
{"sheet":"2nd Loan Repayment","index":9,"n_rows":374,"n_cols":10,"rows_kept":374,"cut":false,"hidden":false,"merged":[[3,1,3,3],[3,5,3,7],[0,0,0,9]]}
["2nd Loan Repayment"]
["Bank:",{"$f":"Questionaire!F110","v":0}]
[]
[null,"Enter Values",null,null,null,"Loan Summary"]
[null,null,"Loan Amount",{"$f":"E5","v":0},{"$f":"Questionaire!$F$111","v":0},null,"Scheduled Payment",{"$f":"IF(Values_Entered,-PMT(Interest_Rate/Num_Pmt_Per_Year,Loan_Years*Num_Pmt_Per_Year,Loan_Amount),\"0\")","v":"0"}]
[null,null,"Annual Interest Rate",{"$f":"E6","v":0},{"$f":"Questionaire!$F$112","v":0},null,"Scheduled Number of Payments",{"$f":"IF(Values_Entered,Loan_Years*Num_Pmt_Per_Year,\"\")","v":""}]
[null,null,"Loan Period in Years",{"$f":"E7","v":0},{"$f":"Questionaire!$F$113","v":0},null,"Actual Number of Payments",{"$f":"IF(Values_Entered,Number_of_Payments,\"\")","v":""}]
[null,null,"Number of Payments Per Year",12,null,null,"Total Early Payments",{"$f":"IF(Values_Entered,SUMIF(Beg_Bal,\">0\",Extra_Pay),\"\")","v":""}]
[null,null,"Start Date of Loan",{"$f":"E9","v":"00:00:00"},{"$f":"Questionaire!$F$115","v":"00:00:00"},null,"Total Interest",{"$f":"IF(Values_Entered,SUMIF(Beg_Bal,\">0\",Int),\"\")","v":""}]
[null,null,"Optional Extra Payments",0]
[]
[]
["PmtNo.","Payment Date","Beginning Balance","Scheduled Payment","Extra Payment","Total Payment","Principal","Interest","Ending Balance","Cumulative Interest"]
[]
[{"$f":"IF(Values_Entered,1,\"\")","v":""},{"$f":"IF(Pay_Num<>\"\",DATE(YEAR(Loan_Start),MONTH(Loan_Start)+(Pay_Num)*12/Num_Pmt_Per_Year,DAY(Loan_Start)),\"\")","v":""},{"$f":"IF(Values_Entered,Loan_Amount,\"\")","v":""},{"$f":"IF(Pay_Num<>\"\",Scheduled_Monthly_Payment,\"\")","v":""},{"$f":"IF(AND(Pay_Num<>\"\",Sched_Pay+Scheduled_Extra_Payments<Beg_Bal),Scheduled_Extra_Payments,IF(AND(Pay_Num<>\"\",Beg_Bal-Sched_Pay>0),Beg_Bal-Sched_Pay,IF(Pay_Num<>\"\",0,\"\")))","v":{"$error":"#VALUE!"}},{"$f":"IF(AND(Pay_Num<>\"\",Sched_Pay+Extra_Pay<Beg_Bal),Sched_Pay+Extra_Pay,IF(Pay_Num<>\"\",Beg_Bal,\"\"))","v":{"$error":"#VALUE!"}},{"$f":"IF(Pay_Num<>\"\",Total_Pay-Int,\"\")","v":""},{"$f":"IF(Pay_Num<>\"\",Beg_Bal*(Interest_Rate/Num_Pmt_Per_Year),\"\")","v":""},{"$f":"IF(AND(Pay_Num<>\"\",Sched_Pay+Extra_Pay<Beg_Bal),Beg_Bal-Princ,IF(Pay_Num<>\"\",0,\"\"))","v":{"$error":"#VALUE!"}},{"$f":"SUM($H$15:$H15)","v":0}]
{"$rows_left_out":359}